1. * Package: x11-misc/xrmap-2.33-r1
  2. * Repository: gentoo
  3. * Maintainer: desktop-misc@gentoo.org
  4. * USE: abi_x86_64 amd64 elibc_glibc kernel_linux test userland_GNU
  5. * FEATURES: sandbox test userpriv usersandbox
  6. Installed LAPACK for library directory lib64
  7. [1] reference *
  8. Installed BLAS for library directory lib64
  9. [1] reference *
  10. Installed CBLAS for library directory lib64
  11. [1] gsl
  12. [2] reference *
  13. >>> Unpacking source...
  14. >>> Unpacking xrmap-2.33.tar.bz2 to /tmp/portage/x11-misc/xrmap-2.33-r1/work
  15. >>> Unpacking factbook_html_2008.tar.bz2 to /tmp/portage/x11-misc/xrmap-2.33-r1/work
  16. >>> Unpacking anthems-1.3.tar.bz2 to /tmp/portage/x11-misc/xrmap-2.33-r1/work
  17. >>> Unpacking flags-2.9-xpm_150.tar.bz2 to /tmp/portage/x11-misc/xrmap-2.33-r1/work
  18. >>> Unpacking hymns-1.4.tar.bz2 to /tmp/portage/x11-misc/xrmap-2.33-r1/work
  19. >>> Unpacking earthdata_low_res.tar.bz2 to /tmp/portage/x11-misc/xrmap-2.33-r1/work
  20. >>> Unpacking CIA_WDB2.jpd.gz to /tmp/portage/x11-misc/xrmap-2.33-r1/work
  21. >>> Source unpacked in /tmp/portage/x11-misc/xrmap-2.33-r1/work
  22. >>> Preparing source in /tmp/portage/x11-misc/xrmap-2.33-r1/work/xrmap-2.33 ...
  23. * Applying xrmap-2.33-Makefile.kit.patch ...
  24. [ ok ]
  25. * Applying xrmap-2.33-as-needed.patch ...
  26. [ ok ]
  27. * Applying xrmap-2.33-parallel-make.patch ...
  28. [ ok ]
  29. * Applying xrmap-2.33-libpng15.patch ...
  30. [ ok ]
  31. * Applying xrmap-2.33-zlib.patch ...
  32. [ ok ]
  33. >>> Source prepared.
  34. >>> Configuring source in /tmp/portage/x11-misc/xrmap-2.33-r1/work/xrmap-2.33 ...
  35. >>> Source configured.
  36. >>> Compiling source in /tmp/portage/x11-misc/xrmap-2.33-r1/work/xrmap-2.33 ...
  37. make -j24 HTML_VIEWER=xdg-open
  38. make -C tools
  39. make[1]: Entering directory '/tmp/portage/x11-misc/xrmap-2.33-r1/work/xrmap-2.33/tools'
  40. x86_64-pc-linux-gnu-gcc -O2 -pipe -ggdb -march=native -ftracer -frecord-gcc-switches -Wl,-O1 -Wl,--as-needed preproc.c -o preproc
  41. ./preproc > ../numdefs.h
  42. make[1]: Leaving directory '/tmp/portage/x11-misc/xrmap-2.33-r1/work/xrmap-2.33/tools'
  43. x86_64-pc-linux-gnu-gcc -O2 -pipe -ggdb -march=native -ftracer -frecord-gcc-switches -Wall -DZLIB -DXPMBUG -DSHAREDIR=\"/usr/share/xrmap\" -DPS_VIEWER=\""gv -noantialias"\" -DIM_VIEWER=\""display -background gray84"\" -DSVG_VIEWER=\""inkscape"\" -DSVG_CONVERT=\""inkscape %s --export-height=%d --export-png=%s"\" -DHTML_VIEWER=\"xdg-open\" -DPRINT_CMD=\""lpr -Plocal"\" -DEDITOR=\"less\" -DMIDIPLAYER=\""timidity -ig"\" -c explorer.c
  44. x86_64-pc-linux-gnu-gcc -O2 -pipe -ggdb -march=native -ftracer -frecord-gcc-switches -Wall -DZLIB -DXPMBUG -DSHAREDIR=\"/usr/share/xrmap\" -DPS_VIEWER=\""gv -noantialias"\" -DIM_VIEWER=\""display -background gray84"\" -DSVG_VIEWER=\""inkscape"\" -DSVG_CONVERT=\""inkscape %s --export-height=%d --export-png=%s"\" -DHTML_VIEWER=\"xdg-open\" -DPRINT_CMD=\""lpr -Plocal"\" -DEDITOR=\"less\" -DMIDIPLAYER=\""timidity -ig"\" -c image.c
  45. x86_64-pc-linux-gnu-gcc -O2 -pipe -ggdb -march=native -ftracer -frecord-gcc-switches -Wall -DZLIB -DXPMBUG -DSHAREDIR=\"/usr/share/xrmap\" -DPS_VIEWER=\""gv -noantialias"\" -DIM_VIEWER=\""display -background gray84"\" -DSVG_VIEWER=\""inkscape"\" -DSVG_CONVERT=\""inkscape %s --export-height=%d --export-png=%s"\" -DHTML_VIEWER=\"xdg-open\" -DPRINT_CMD=\""lpr -Plocal"\" -DEDITOR=\"less\" -DMIDIPLAYER=\""timidity -ig"\" -c xrmap.c
  46. xrmap.c: In function 'read_primary':
  47. xrmap.c:481:5: warning: pointer targets in passing argument 10 of 'XGetWindowProperty' differ in signedness [-Wpointer-sign]
  48. In file included from xrmap.c:34:0:
  49. /usr/include/X11/Xlib.h:2688:12: note: expected 'long unsigned int *' but argument is of type 'long int *'
  50. xrmap.c:481:5: warning: pointer targets in passing argument 11 of 'XGetWindowProperty' differ in signedness [-Wpointer-sign]
  51. In file included from xrmap.c:34:0:
  52. /usr/include/X11/Xlib.h:2688:12: note: expected 'long unsigned int *' but argument is of type 'long int *'
  53. xrmap.c:487:3: warning: pointer targets in passing argument 2 of 'strcat' differ in signedness [-Wpointer-sign]
  54. In file included from /usr/include/string.h:640:0,
  55. from xrmap.h:96,
  56. from xrmap.c:45:
  57. /usr/include/bits/string3.h:140:1: note: expected 'const char * __restrict__' but argument is of type 'unsigned char *'
  58. xrmap.c: In function 'write_primary':
  59. xrmap.c:499:23: warning: pointer targets in passing argument 7 of 'XChangeProperty' differ in signedness [-Wpointer-sign]
  60. In file included from xrmap.c:34:0:
  61. /usr/include/X11/Xlib.h:2080:12: note: expected 'const unsigned char *' but argument is of type 'char *'
  62. xrmap.c: In function 'get_color':
  63. xrmap.c:507:13: warning: variable 'bool' set but not used [-Wunused-but-set-variable]
  64. xrmap.c: In function 'print_string':
  65. xrmap.c:838:11: warning: passing argument 1 of 'gzprintf' from incompatible pointer type [enabled by default]
  66. In file included from xrmap.c:42:0:
  67. /usr/include/zlib.h:1349:23: note: expected 'gzFile' but argument is of type 'struct gzFile_s **'
  68. xrmap.c: In function 'close_datawin':
  69. xrmap.c:1116:4: warning: pointer targets in passing argument 4 of 'get_window_placement' differ in signedness [-Wpointer-sign]
  70. xrmap.c:620:5: note: expected 'unsigned int *' but argument is of type 'int *'
  71. xrmap.c:1116:4: warning: pointer targets in passing argument 5 of 'get_window_placement' differ in signedness [-Wpointer-sign]
  72. xrmap.c:620:5: note: expected 'unsigned int *' but argument is of type 'int *'
  73. xrmap.c: In function 'close_flagwin':
  74. xrmap.c:1125:4: warning: pointer targets in passing argument 4 of 'get_window_placement' differ in signedness [-Wpointer-sign]
  75. xrmap.c:620:5: note: expected 'unsigned int *' but argument is of type 'int *'
  76. xrmap.c:1125:4: warning: pointer targets in passing argument 5 of 'get_window_placement' differ in signedness [-Wpointer-sign]
  77. xrmap.c:620:5: note: expected 'unsigned int *' but argument is of type 'int *'
  78. xrmap.c: In function 'close_cmdwin':
  79. xrmap.c:1136:4: warning: pointer targets in passing argument 4 of 'get_window_placement' differ in signedness [-Wpointer-sign]
  80. xrmap.c:620:5: note: expected 'unsigned int *' but argument is of type 'int *'
  81. xrmap.c:1136:4: warning: pointer targets in passing argument 5 of 'get_window_placement' differ in signedness [-Wpointer-sign]
  82. xrmap.c:620:5: note: expected 'unsigned int *' but argument is of type 'int *'
  83. explorer.c: In function 'show_explwin':
  84. explorer.c:407:15: warning: ignoring return value of 'system', declared with attribute warn_unused_result [-Wunused-result]
  85. explorer.c: In function 'get_dir_list':
  86. explorer.c:157:10: warning: ignoring return value of 'getcwd', declared with attribute warn_unused_result [-Wunused-result]
  87. explorer.c:163:12: warning: ignoring return value of 'chdir', declared with attribute warn_unused_result [-Wunused-result]
  88. explorer.c:170:12: warning: ignoring return value of 'chdir', declared with attribute warn_unused_result [-Wunused-result]
  89. explorer.c:190:12: warning: ignoring return value of 'chdir', declared with attribute warn_unused_result [-Wunused-result]
  90. explorer.c:204:9: warning: ignoring return value of 'chdir', declared with attribute warn_unused_result [-Wunused-result]
  91. image.c: In function 'readPNG':
  92. image.c:334:10: warning: pointer targets in assignment differ in signedness [-Wpointer-sign]
  93. image.c:361:13: warning: pointer targets in assignment differ in signedness [-Wpointer-sign]
  94. image.c:406:9: warning: pointer targets in passing argument 1 of 'fill_line' differ in signedness [-Wpointer-sign]
  95. image.c:142:1: note: expected 'char *' but argument is of type 'unsigned char *'
  96. image.c:406:9: warning: pointer targets in passing argument 2 of 'fill_line' differ in signedness [-Wpointer-sign]
  97. image.c:142:1: note: expected 'char *' but argument is of type 'unsigned char *'
  98. image.c:415:21: warning: pointer targets in assignment differ in signedness [-Wpointer-sign]
  99. image.c:420:21: warning: pointer targets in assignment differ in signedness [-Wpointer-sign]
  100. xrmap.c: In function 'get_button_dimensions':
  101. xrmap.c:2883:13: warning: pointer targets in passing argument 6 of 'XGetGeometry' differ in signedness [-Wpointer-sign]
  102. In file included from xrmap.c:34:0:
  103. /usr/include/X11/Xlib.h:2632:15: note: expected 'unsigned int *' but argument is of type 'int *'
  104. xrmap.c:2883:13: warning: pointer targets in passing argument 7 of 'XGetGeometry' differ in signedness [-Wpointer-sign]
  105. In file included from xrmap.c:34:0:
  106. /usr/include/X11/Xlib.h:2632:15: note: expected 'unsigned int *' but argument is of type 'int *'
  107. image.c: In function 'DoExtension':
  108. image.c:653:11: warning: variable 'str' set but not used [-Wunused-but-set-variable]
  109. image.c: In function 'ReadImage':
  110. image.c:924:6: warning: pointer targets in passing argument 1 of 'fill_line' differ in signedness [-Wpointer-sign]
  111. image.c:142:1: note: expected 'char *' but argument is of type 'unsigned char *'
  112. image.c: In function 'readXPM':
  113. image.c:1153:11: warning: pointer targets in assignment differ in signedness [-Wpointer-sign]
  114. xrmap.c: In function 'close_outfile':
  115. xrmap.c:3911:11: warning: passing argument 1 of 'gzclose' from incompatible pointer type [enabled by default]
  116. In file included from xrmap.c:42:0:
  117. /usr/include/zlib.h:1511:24: note: expected 'gzFile' but argument is of type 'struct gzFile_s **'
  118. image.c: In function 'readSVG':
  119. image.c:1278:11: warning: ignoring return value of 'system', declared with attribute warn_unused_result [-Wunused-result]
  120. image.c: In function 'readEPS':
  121. image.c:1239:11: warning: ignoring return value of 'system', declared with attribute warn_unused_result [-Wunused-result]
  122. xrmap.c: In function 'print_PS_image':
  123. xrmap.c:4121:13: warning: passing argument 1 of 'gzputc' from incompatible pointer type [enabled by default]
  124. In file included from xrmap.c:42:0:
  125. /usr/include/zlib.h:1385:21: note: expected 'gzFile' but argument is of type 'struct gzFile_s **'
  126. xrmap.c: In function 'print_PPM_image':
  127. xrmap.c:4192:13: warning: passing argument 1 of 'gzputc' from incompatible pointer type [enabled by default]
  128. In file included from xrmap.c:42:0:
  129. /usr/include/zlib.h:1385:21: note: expected 'gzFile' but argument is of type 'struct gzFile_s **'
  130. xrmap.c:4193:13: warning: passing argument 1 of 'gzputc' from incompatible pointer type [enabled by default]
  131. In file included from xrmap.c:42:0:
  132. /usr/include/zlib.h:1385:21: note: expected 'gzFile' but argument is of type 'struct gzFile_s **'
  133. xrmap.c:4194:13: warning: passing argument 1 of 'gzputc' from incompatible pointer type [enabled by default]
  134. In file included from xrmap.c:42:0:
  135. /usr/include/zlib.h:1385:21: note: expected 'gzFile' but argument is of type 'struct gzFile_s **'
  136. xrmap.c: In function 'print_image':
  137. xrmap.c:4241:13: warning: passing argument 1 of 'gzflush' from incompatible pointer type [enabled by default]
  138. In file included from xrmap.c:42:0:
  139. /usr/include/zlib.h:1412:21: note: expected 'gzFile' but argument is of type 'struct gzFile_s **'
  140. xrmap.c: In function 'draw_feature':
  141. xrmap.c:5191:16: warning: variable 'j' set but not used [-Wunused-but-set-variable]
  142. xrmap.c: In function 'arcinfo_lines':
  143. xrmap.c:5862:10: warning: pointer targets in passing argument 1 of 'str4toint' differ in signedness [-Wpointer-sign]
  144. xrmap.c:4683:12: note: expected 'unsigned char *' but argument is of type 'char *'
  145. xrmap.c:5863:3: warning: pointer targets in passing argument 1 of 'str3toint' differ in signedness [-Wpointer-sign]
  146. xrmap.c:4675:12: note: expected 'unsigned char *' but argument is of type 'char *'
  147. xrmap.c:5864:3: warning: pointer targets in passing argument 1 of 'str3toint' differ in signedness [-Wpointer-sign]
  148. xrmap.c:4675:12: note: expected 'unsigned char *' but argument is of type 'char *'
  149. xrmap.c:5913:5: warning: passing argument 1 of 'gzgets' from incompatible pointer type [enabled by default]
  150. In file included from xrmap.c:42:0:
  151. /usr/include/zlib.h:1372:24: note: expected 'gzFile' but argument is of type 'struct gzFile_s **'
  152. xrmap.c:5923:5: warning: passing argument 1 of 'gzgets' from incompatible pointer type [enabled by default]
  153. In file included from xrmap.c:42:0:
  154. /usr/include/zlib.h:1372:24: note: expected 'gzFile' but argument is of type 'struct gzFile_s **'
  155. xrmap.c:5940:4: warning: passing argument 1 of 'gzseek' from incompatible pointer type [enabled by default]
  156. In file included from xrmap.c:42:0:
  157. /usr/include/zlib.h:1726:28: note: expected 'gzFile' but argument is of type 'struct gzFile_s **'
  158. xrmap.c:5947:4: warning: passing argument 1 of 'gzgets' from incompatible pointer type [enabled by default]
  159. In file included from xrmap.c:42:0:
  160. /usr/include/zlib.h:1372:24: note: expected 'gzFile' but argument is of type 'struct gzFile_s **'
  161. xrmap.c:5986:5: warning: passing argument 1 of 'gzclose' from incompatible pointer type [enabled by default]
  162. In file included from xrmap.c:42:0:
  163. /usr/include/zlib.h:1511:24: note: expected 'gzFile' but argument is of type 'struct gzFile_s **'
  164. xrmap.c: In function 'dump_arcs':
  165. xrmap.c:6102:10: warning: pointer targets in passing argument 1 of 'str4toint' differ in signedness [-Wpointer-sign]
  166. xrmap.c:4683:12: note: expected 'unsigned char *' but argument is of type 'char *'
  167. xrmap.c:6160:21: warning: pointer targets in assignment differ in signedness [-Wpointer-sign]
  168. xrmap.c:6161:3: warning: pointer targets in passing argument 1 of 'str3toint' differ in signedness [-Wpointer-sign]
  169. xrmap.c:4675:12: note: expected 'unsigned char *' but argument is of type 'char *'
  170. xrmap.c:6162:3: warning: pointer targets in passing argument 1 of 'str3toint' differ in signedness [-Wpointer-sign]
  171. xrmap.c:4675:12: note: expected 'unsigned char *' but argument is of type 'char *'
  172. xrmap.c:6182:10: warning: pointer targets in passing argument 1 of 'str4toint' differ in signedness [-Wpointer-sign]
  173. xrmap.c:4683:12: note: expected 'unsigned char *' but argument is of type 'char *'
  174. xrmap.c:6183:3: warning: pointer targets in passing argument 1 of 'str3toint' differ in signedness [-Wpointer-sign]
  175. xrmap.c:4675:12: note: expected 'unsigned char *' but argument is of type 'char *'
  176. xrmap.c:6184:3: warning: pointer targets in passing argument 1 of 'str3toint' differ in signedness [-Wpointer-sign]
  177. xrmap.c:4675:12: note: expected 'unsigned char *' but argument is of type 'char *'
  178. xrmap.c:6221:8: warning: format not a string literal and no format arguments [-Wformat-security]
  179. xrmap.c:6257:7: warning: pointer targets in passing argument 1 of 'str4toint' differ in signedness [-Wpointer-sign]
  180. xrmap.c:4683:12: note: expected 'unsigned char *' but argument is of type 'char *'
  181. xrmap.c:6258:14: warning: pointer targets in passing argument 1 of 'str3toint' differ in signedness [-Wpointer-sign]
  182. xrmap.c:4675:12: note: expected 'unsigned char *' but argument is of type 'char *'
  183. xrmap.c:6259:14: warning: pointer targets in passing argument 1 of 'str3toint' differ in signedness [-Wpointer-sign]
  184. xrmap.c:4675:12: note: expected 'unsigned char *' but argument is of type 'char *'
  185. xrmap.c:6300:18: warning: pointer targets in assignment differ in signedness [-Wpointer-sign]
  186. xrmap.c:6309:7: warning: pointer targets in passing argument 1 of 'str4toint' differ in signedness [-Wpointer-sign]
  187. xrmap.c:4683:12: note: expected 'unsigned char *' but argument is of type 'char *'
  188. xrmap.c: In function 'seg_scan':
  189. xrmap.c:6378:15: warning: pointer targets in assignment differ in signedness [-Wpointer-sign]
  190. xrmap.c:6379:11: warning: pointer targets in passing argument 1 of 'str3toint' differ in signedness [-Wpointer-sign]
  191. xrmap.c:4675:12: note: expected 'unsigned char *' but argument is of type 'char *'
  192. xrmap.c:6380:4: warning: pointer targets in passing argument 1 of 'str3toint' differ in signedness [-Wpointer-sign]
  193. xrmap.c:4675:12: note: expected 'unsigned char *' but argument is of type 'char *'
  194. xrmap.c: In function 'generate':
  195. xrmap.c:6733:6: warning: passing argument 1 of 'gzread' from incompatible pointer type [enabled by default]
  196. In file included from xrmap.c:42:0:
  197. /usr/include/zlib.h:1313:21: note: expected 'gzFile' but argument is of type 'struct gzFile_s **'
  198. xrmap.c:6745:6: warning: passing argument 1 of 'gzclose' from incompatible pointer type [enabled by default]
  199. In file included from xrmap.c:42:0:
  200. /usr/include/zlib.h:1511:24: note: expected 'gzFile' but argument is of type 'struct gzFile_s **'
  201. xrmap.c:6774:5: warning: passing argument 1 of 'gzseek' from incompatible pointer type [enabled by default]
  202. In file included from xrmap.c:42:0:
  203. /usr/include/zlib.h:1726:28: note: expected 'gzFile' but argument is of type 'struct gzFile_s **'
  204. xrmap.c:6776:23: warning: passing argument 1 of 'gzread' from incompatible pointer type [enabled by default]
  205. In file included from xrmap.c:42:0:
  206. /usr/include/zlib.h:1313:21: note: expected 'gzFile' but argument is of type 'struct gzFile_s **'
  207. xrmap.c:6797:12: warning: passing argument 1 of 'gzseek' from incompatible pointer type [enabled by default]
  208. In file included from xrmap.c:42:0:
  209. /usr/include/zlib.h:1726:28: note: expected 'gzFile' but argument is of type 'struct gzFile_s **'
  210. xrmap.c:6798:12: warning: passing argument 1 of 'gzread' from incompatible pointer type [enabled by default]
  211. In file included from xrmap.c:42:0:
  212. /usr/include/zlib.h:1313:21: note: expected 'gzFile' but argument is of type 'struct gzFile_s **'
  213. xrmap.c:6799:5: warning: passing argument 1 of 'gzclose' from incompatible pointer type [enabled by default]
  214. In file included from xrmap.c:42:0:
  215. /usr/include/zlib.h:1511:24: note: expected 'gzFile' but argument is of type 'struct gzFile_s **'
  216. xrmap.c:6816:20: warning: pointer targets in assignment differ in signedness [-Wpointer-sign]
  217. xrmap.c:6977:16: warning: passing argument 1 of 'gzseek' from incompatible pointer type [enabled by default]
  218. In file included from xrmap.c:42:0:
  219. /usr/include/zlib.h:1726:28: note: expected 'gzFile' but argument is of type 'struct gzFile_s **'
  220. xrmap.c:6978:16: warning: passing argument 1 of 'gzread' from incompatible pointer type [enabled by default]
  221. In file included from xrmap.c:42:0:
  222. /usr/include/zlib.h:1313:21: note: expected 'gzFile' but argument is of type 'struct gzFile_s **'
  223. xrmap.c:6987:19: warning: pointer targets in passing argument 1 of 'str3toint' differ in signedness [-Wpointer-sign]
  224. xrmap.c:4675:12: note: expected 'unsigned char *' but argument is of type 'signed char *'
  225. xrmap.c:6988:5: warning: pointer targets in passing argument 1 of 'str3toint' differ in signedness [-Wpointer-sign]
  226. xrmap.c:4675:12: note: expected 'unsigned char *' but argument is of type 'signed char *'
  227. xrmap.c:7055:5: warning: passing argument 1 of 'gzclose' from incompatible pointer type [enabled by default]
  228. In file included from xrmap.c:42:0:
  229. /usr/include/zlib.h:1511:24: note: expected 'gzFile' but argument is of type 'struct gzFile_s **'
  230. xrmap.c: In function 'show_datawin':
  231. xrmap.c:8854:10: warning: pointer targets in passing argument 4 of 'get_window_placement' differ in signedness [-Wpointer-sign]
  232. xrmap.c:620:5: note: expected 'unsigned int *' but argument is of type 'int *'
  233. xrmap.c:8854:10: warning: pointer targets in passing argument 5 of 'get_window_placement' differ in signedness [-Wpointer-sign]
  234. xrmap.c:620:5: note: expected 'unsigned int *' but argument is of type 'int *'
  235. xrmap.c:8918:7: warning: format not a string literal and no format arguments [-Wformat-security]
  236. xrmap.c:8927:7: warning: format not a string literal and no format arguments [-Wformat-security]
  237. xrmap.c:8949:10: warning: format not a string literal and no format arguments [-Wformat-security]
  238. xrmap.c:8965:7: warning: format not a string literal and no format arguments [-Wformat-security]
  239. xrmap.c:8966:7: warning: format not a string literal and no format arguments [-Wformat-security]
  240. xrmap.c:9054:4: warning: pointer targets in passing argument 4 of 'get_window_placement' differ in signedness [-Wpointer-sign]
  241. xrmap.c:620:5: note: expected 'unsigned int *' but argument is of type 'int *'
  242. xrmap.c:9054:4: warning: pointer targets in passing argument 5 of 'get_window_placement' differ in signedness [-Wpointer-sign]
  243. xrmap.c:620:5: note: expected 'unsigned int *' but argument is of type 'int *'
  244. xrmap.c:9076:22: warning: trigraph ??/ ignored, use -trigraphs to enable [-Wtrigraphs]
  245. xrmap.c: In function 'show_flagwin':
  246. xrmap.c:9197:7: warning: pointer targets in passing argument 4 of 'get_window_placement' differ in signedness [-Wpointer-sign]
  247. xrmap.c:620:5: note: expected 'unsigned int *' but argument is of type 'int *'
  248. xrmap.c:9197:7: warning: pointer targets in passing argument 5 of 'get_window_placement' differ in signedness [-Wpointer-sign]
  249. xrmap.c:620:5: note: expected 'unsigned int *' but argument is of type 'int *'
  250. xrmap.c: In function 'show_point':
  251. xrmap.c:9300:22: warning: variable 'vf' set but not used [-Wunused-but-set-variable]
  252. xrmap.c:9300:16: warning: variable 'uf' set but not used [-Wunused-but-set-variable]
  253. xrmap.c: In function 'main':
  254. xrmap.c:10574:32: warning: format not a string literal and no format arguments [-Wformat-security]
  255. xrmap.c:9816:14: warning: variable 'ev_time' set but not used [-Wunused-but-set-variable]
  256. xrmap.c:10332:29: warning: ignoring return value of 'getcwd', declared with attribute warn_unused_result [-Wunused-result]
  257. xrmap.c:10559:32: warning: ignoring return value of 'system', declared with attribute warn_unused_result [-Wunused-result]
  258. xrmap.c:10582:35: warning: ignoring return value of 'system', declared with attribute warn_unused_result [-Wunused-result]
  259. xrmap.c:10588:32: warning: ignoring return value of 'system', declared with attribute warn_unused_result [-Wunused-result]
  260. xrmap.c:10592:11: warning: ignoring return value of 'system', declared with attribute warn_unused_result [-Wunused-result]
  261. xrmap.c:11165:14: warning: ignoring return value of 'system', declared with attribute warn_unused_result [-Wunused-result]
  262. xrmap.c:11195:11: warning: ignoring return value of 'system', declared with attribute warn_unused_result [-Wunused-result]
  263. xrmap.c:11220:13: warning: ignoring return value of 'getcwd', declared with attribute warn_unused_result [-Wunused-result]
  264. xrmap.c:11277:13: warning: ignoring return value of 'system', declared with attribute warn_unused_result [-Wunused-result]
  265. xrmap.c:11280:13: warning: ignoring return value of 'system', declared with attribute warn_unused_result [-Wunused-result]
  266. xrmap.c:11285:13: warning: ignoring return value of 'getcwd', declared with attribute warn_unused_result [-Wunused-result]
  267. xrmap.c:11549:29: warning: ignoring return value of 'getcwd', declared with attribute warn_unused_result [-Wunused-result]
  268. xrmap.c:11567:26: warning: ignoring return value of 'system', declared with attribute warn_unused_result [-Wunused-result]
  269. xrmap.c:11598:13: warning: ignoring return value of 'system', declared with attribute warn_unused_result [-Wunused-result]
  270. xrmap.c: In function 'do_activate':
  271. xrmap.c:9531:14: warning: ignoring return value of 'system', declared with attribute warn_unused_result [-Wunused-result]
  272. xrmap.c: In function 'show_point':
  273. xrmap.c:9338:11: warning: ignoring return value of 'system', declared with attribute warn_unused_result [-Wunused-result]
  274. xrmap.c: In function 'view_outfile':
  275. xrmap.c:9259:13: warning: ignoring return value of 'system', declared with attribute warn_unused_result [-Wunused-result]
  276. xrmap.c:9263:13: warning: ignoring return value of 'system', declared with attribute warn_unused_result [-Wunused-result]
  277. xrmap.c:9267:13: warning: ignoring return value of 'system', declared with attribute warn_unused_result [-Wunused-result]
  278. xrmap.c: In function 'flag_viewer':
  279. xrmap.c:9171:10: warning: ignoring return value of 'system', declared with attribute warn_unused_result [-Wunused-result]
  280. xrmap.c: In function 'show_manual':
  281. xrmap.c:7896:12: warning: ignoring return value of 'system', declared with attribute warn_unused_result [-Wunused-result]
  282. xrmap.c:7962:12: warning: ignoring return value of 'system', declared with attribute warn_unused_result [-Wunused-result]
  283. x86_64-pc-linux-gnu-gcc -o xrmap explorer.o image.o xrmap.o -Wl,-O1 -Wl,--as-needed -Wall -lXpm -lX11 -ljpeg -lz -lpng -lm -L/usr/X11R6/lib
  284. make -C editkit -f Makefile.kit DESTDIR=/usr
  285. make[1]: Entering directory '/tmp/portage/x11-misc/xrmap-2.33-r1/work/xrmap-2.33/editkit'
  286. x86_64-pc-linux-gnu-gcc -O2 -fomit-frame-pointer -pipe -Wall -DTHREED -DGREEK -DJUSTIFY -DSHAREDIR="\"/usr/share/editkit\"" -DSHAREDIR="\"\"" -Wl,-O1 -Wl,--as-needed -O2 -fomit-frame-pointer -pipe -Wall -DTHREED -DGREEK -DJUSTIFY -DSHAREDIR="\"/usr/share/editkit\"" -DSHAREDIR="\"\"" -DWORDSTAR -o edt.o -c termcap.c
  287. x86_64-pc-linux-gnu-gcc -O2 -fomit-frame-pointer -pipe -Wall -DTHREED -DGREEK -DJUSTIFY -DSHAREDIR="\"/usr/share/editkit\"" -DSHAREDIR="\"\"" -Wl,-O1 -Wl,--as-needed -O2 -fomit-frame-pointer -pipe -Wall -DTHREED -DGREEK -DJUSTIFY -DSHAREDIR="\"/usr/share/editkit\"" -DSHAREDIR="\"\"" -DEMACS -o emt.o -c termcap.c
  288. x86_64-pc-linux-gnu-gcc -O2 -fomit-frame-pointer -pipe -Wall -DTHREED -DGREEK -DJUSTIFY -DSHAREDIR="\"/usr/share/editkit\"" -DSHAREDIR="\"\"" -Wl,-O1 -Wl,--as-needed -O2 -fomit-frame-pointer -pipe -Wall -DTHREED -DGREEK -DJUSTIFY -DSHAREDIR="\"/usr/share/editkit\"" -DSHAREDIR="\"\"" -DWORDSTAR -o edx.o -c x11.c
  289. x86_64-pc-linux-gnu-gcc -O2 -fomit-frame-pointer -pipe -Wall -DTHREED -DGREEK -DJUSTIFY -DSHAREDIR="\"/usr/share/editkit\"" -DSHAREDIR="\"\"" -Wl,-O1 -Wl,--as-needed -O2 -fomit-frame-pointer -pipe -Wall -DTHREED -DGREEK -DJUSTIFY -DSHAREDIR="\"/usr/share/editkit\"" -DSHAREDIR="\"\"" -DEMACS -o emx.o -c x11.c
  290. <command-line>:0:0: warning: "SHAREDIR" redefined [enabled by default]
  291. <command-line>:0:0: note: this is the location of the previous definition
  292. <command-line>:0:0: warning: "SHAREDIR" redefined [enabled by default]
  293. <command-line>:0:0: note: this is the location of the previous definition
  294. <command-line>:0:0: warning: "SHAREDIR" redefined [enabled by default]
  295. <command-line>:0:0: note: this is the location of the previous definition
  296. <command-line>:0:0: warning: "SHAREDIR" redefined [enabled by default]
  297. <command-line>:0:0: note: this is the location of the previous definition
  298. <command-line>:0:0: warning: "SHAREDIR" redefined [enabled by default]
  299. <command-line>:0:0: note: this is the location of the previous definition
  300. <command-line>:0:0: warning: "SHAREDIR" redefined [enabled by default]
  301. <command-line>:0:0: note: this is the location of the previous definition
  302. <command-line>:0:0: warning: "SHAREDIR" redefined [enabled by default]
  303. <command-line>:0:0: note: this is the location of the previous definition
  304. <command-line>:0:0: warning: "SHAREDIR" redefined [enabled by default]
  305. <command-line>:0:0: note: this is the location of the previous definition
  306. <command-line>:0:0: warning: "SHAREDIR" redefined [enabled by default]
  307. <command-line>:0:0: note: this is the location of the previous definition
  308. <command-line>:0:0: warning: "SHAREDIR" redefined [enabled by default]
  309. <command-line>:0:0: note: this is the location of the previous definition
  310. <command-line>:0:0: warning: "SHAREDIR" redefined [enabled by default]
  311. <command-line>:0:0: note: this is the location of the previous definition
  312. <command-line>:0:0: warning: "SHAREDIR" redefined [enabled by default]
  313. <command-line>:0:0: note: this is the location of the previous definition
  314. In file included from termcap.c:204:0:
  315. edit.h:112:5: warning: built-in function 'y1' declared as non-function [enabled by default]
  316. In file included from term_bind_em.c:23:0,
  317. from termcap.c:629:
  318. edit.c: In function 'realloc_buffer':
  319. edit.c:109:9: warning: cast from pointer to integer of different size [-Wpointer-to-int-cast]
  320. edit.c:109:20: warning: cast from pointer to integer of different size [-Wpointer-to-int-cast]
  321. edit.c: In function 'new_undo':
  322. edit.c:142:14: warning: cast from pointer to integer of different size [-Wpointer-to-int-cast]
  323. edit.c:142:37: warning: cast from pointer to integer of different size [-Wpointer-to-int-cast]
  324. In file included from termcap.c:204:0:
  325. edit.h:112:5: warning: built-in function 'y1' declared as non-function [enabled by default]
  326. In file included from term_bind_ws.c:17:0,
  327. from termcap.c:632:
  328. edit.c: In function 'realloc_buffer':
  329. edit.c:109:9: warning: cast from pointer to integer of different size [-Wpointer-to-int-cast]
  330. edit.c:109:20: warning: cast from pointer to integer of different size [-Wpointer-to-int-cast]
  331. edit.c: In function 'new_undo':
  332. edit.c:142:14: warning: cast from pointer to integer of different size [-Wpointer-to-int-cast]
  333. edit.c:142:37: warning: cast from pointer to integer of different size [-Wpointer-to-int-cast]
  334. edit.c: In function 'doblockr':
  335. edit.c:1724:8: warning: cast from pointer to integer of different size [-Wpointer-to-int-cast]
  336. edit.c:1726:8: warning: cast from pointer to integer of different size [-Wpointer-to-int-cast]
  337. edit.c: In function 'key_normal':
  338. edit.c:2135:6: warning: variable 'xtmp' set but not used [-Wunused-but-set-variable]
  339. edit.c: In function 'doblockr':
  340. edit.c:1724:8: warning: cast from pointer to integer of different size [-Wpointer-to-int-cast]
  341. edit.c:1726:8: warning: cast from pointer to integer of different size [-Wpointer-to-int-cast]
  342. In file included from x11.c:148:0:
  343. edit.h:112:5: warning: built-in function 'y1' declared as non-function [enabled by default]
  344. edit.c: In function 'key_normal':
  345. edit.c:2135:6: warning: variable 'xtmp' set but not used [-Wunused-but-set-variable]
  346. In file included from x11_bind_em.c:23:0,
  347. from x11.c:151:
  348. edit.c: In function 'realloc_buffer':
  349. edit.c:109:9: warning: cast from pointer to integer of different size [-Wpointer-to-int-cast]
  350. edit.c:109:20: warning: cast from pointer to integer of different size [-Wpointer-to-int-cast]
  351. edit.c: In function 'new_undo':In file included from x11.c:148:0:
  352. edit.h:112:5: warning: built-in function 'y1' declared as non-function [enabled by default]
  353. edit.c:142:14: warning: cast from pointer to integer of different size [-Wpointer-to-int-cast]
  354. edit.c:142:37: warning: cast from pointer to integer of different size [-Wpointer-to-int-cast]
  355. termcap.c: In function 'main':
  356. termcap.c:785:9: warning: ignoring return value of 'getcwd', declared with attribute warn_unused_result [-Wunused-result]
  357. In file included from x11_bind_ws.c:17:0,
  358. from x11.c:154:
  359. edit.c: In function 'realloc_buffer':
  360. edit.c:109:9: warning: cast from pointer to integer of different size [-Wpointer-to-int-cast]
  361. edit.c:109:20: warning: cast from pointer to integer of different size [-Wpointer-to-int-cast]
  362. edit.c: In function 'new_undo':
  363. edit.c:142:14: warning: cast from pointer to integer of different size [-Wpointer-to-int-cast]
  364. edit.c:142:37: warning: cast from pointer to integer of different size [-Wpointer-to-int-cast]
  365. termcap.c: In function 'main':
  366. termcap.c:785:9: warning: ignoring return value of 'getcwd', declared with attribute warn_unused_result [-Wunused-result]
  367. In file included from term_bind_em.c:23:0,
  368. from termcap.c:629:
  369. termcap.c: In function 'block_get':
  370. edit.c:1564:8: warning: ignoring return value of 'fread', declared with attribute warn_unused_result [-Wunused-result]
  371. edit.c: In function 'doblockr':
  372. edit.c:1724:8: warning: cast from pointer to integer of different size [-Wpointer-to-int-cast]
  373. edit.c:1726:8: warning: cast from pointer to integer of different size [-Wpointer-to-int-cast]
  374. edit.c: In function 'doblockr':
  375. edit.c:1724:8: warning: cast from pointer to integer of different size [-Wpointer-to-int-cast]
  376. edit.c:1726:8: warning: cast from pointer to integer of different size [-Wpointer-to-int-cast]
  377. edit.c: In function 'key_normal':
  378. edit.c:2135:6: warning: variable 'xtmp' set but not used [-Wunused-but-set-variable]
  379. In file included from term_bind_ws.c:17:0,
  380. from termcap.c:632:
  381. termcap.c: In function 'block_get':
  382. edit.c:1564:8: warning: ignoring return value of 'fread', declared with attribute warn_unused_result [-Wunused-result]
  383. termcap.c: In function 'do_cd':
  384. edit.c:1125:7: warning: ignoring return value of 'chdir', declared with attribute warn_unused_result [-Wunused-result]
  385. edit.c: In function 'key_normal':
  386. edit.c:2135:6: warning: variable 'xtmp' set but not used [-Wunused-but-set-variable]
  387. x11.c: In function 'paste_primary':
  388. x11.c:408:5: warning: pointer targets in passing argument 10 of 'XGetWindowProperty' differ in signedness [-Wpointer-sign]
  389. In file included from x11.c:17:0:
  390. /usr/include/X11/Xlib.h:2688:12: note: expected 'long unsigned int *' but argument is of type 'long int *'
  391. x11.c:408:5: warning: pointer targets in passing argument 11 of 'XGetWindowProperty' differ in signedness [-Wpointer-sign]
  392. In file included from x11.c:17:0:
  393. /usr/include/X11/Xlib.h:2688:12: note: expected 'long unsigned int *' but argument is of type 'long int *'
  394. termcap.c: In function 'do_cd':
  395. edit.c:1125:7: warning: ignoring return value of 'chdir', declared with attribute warn_unused_result [-Wunused-result]
  396. x11.c: In function 'set_selection':
  397. x11.c:476:4: warning: pointer targets in passing argument 7 of 'XChangeProperty' differ in signedness [-Wpointer-sign]
  398. In file included from x11.c:17:0:
  399. /usr/include/X11/Xlib.h:2080:12: note: expected 'const unsigned char *' but argument is of type 'char *'
  400. x11.c: In function 'send_selection':
  401. x11.c:490:4: warning: pointer targets in passing argument 7 of 'XChangeProperty' differ in signedness [-Wpointer-sign]
  402. In file included from x11.c:17:0:
  403. /usr/include/X11/Xlib.h:2080:12: note: expected 'const unsigned char *' but argument is of type 'char *'
  404. x11.c: In function 'paste_primary':
  405. x11.c:408:5: warning: pointer targets in passing argument 10 of 'XGetWindowProperty' differ in signedness [-Wpointer-sign]
  406. In file included from x11.c:17:0:
  407. /usr/include/X11/Xlib.h:2688:12: note: expected 'long unsigned int *' but argument is of type 'long int *'
  408. x11.c:408:5: warning: pointer targets in passing argument 11 of 'XGetWindowProperty' differ in signedness [-Wpointer-sign]
  409. In file included from x11.c:17:0:
  410. /usr/include/X11/Xlib.h:2688:12: note: expected 'long unsigned int *' but argument is of type 'long int *'
  411. x11.c: In function 'set_selection':
  412. x11.c:476:4: warning: pointer targets in passing argument 7 of 'XChangeProperty' differ in signedness [-Wpointer-sign]
  413. In file included from x11.c:17:0:
  414. /usr/include/X11/Xlib.h:2080:12: note: expected 'const unsigned char *' but argument is of type 'char *'
  415. x11.c: In function 'send_selection':
  416. x11.c:490:4: warning: pointer targets in passing argument 7 of 'XChangeProperty' differ in signedness [-Wpointer-sign]
  417. In file included from x11.c:17:0:
  418. /usr/include/X11/Xlib.h:2080:12: note: expected 'const unsigned char *' but argument is of type 'char *'
  419. x11.c: In function 'main':
  420. x11.c:862:9: warning: ignoring return value of 'getcwd', declared with attribute warn_unused_result [-Wunused-result]
  421. x11.c: In function 'main':
  422. x11.c:862:9: warning: ignoring return value of 'getcwd', declared with attribute warn_unused_result [-Wunused-result]
  423. In file included from x11_bind_em.c:23:0,
  424. from x11.c:151:
  425. x11.c: In function 'block_get':
  426. edit.c:1564:8: warning: ignoring return value of 'fread', declared with attribute warn_unused_result [-Wunused-result]
  427. In file included from x11_bind_ws.c:17:0,
  428. from x11.c:154:
  429. x11.c: In function 'block_get':
  430. edit.c:1564:8: warning: ignoring return value of 'fread', declared with attribute warn_unused_result [-Wunused-result]
  431. x11.c: In function 'do_cd':
  432. edit.c:1125:7: warning: ignoring return value of 'chdir', declared with attribute warn_unused_result [-Wunused-result]
  433. x11.c: In function 'do_cd':
  434. edit.c:1125:7: warning: ignoring return value of 'chdir', declared with attribute warn_unused_result [-Wunused-result]
  435. x86_64-pc-linux-gnu-gcc -O2 -fomit-frame-pointer -pipe -Wall -DTHREED -DGREEK -DJUSTIFY -DSHAREDIR="\"/usr/share/editkit\"" -DSHAREDIR="\"\"" -Wl,-O1 -Wl,--as-needed -O2 -fomit-frame-pointer -pipe -Wall -DTHREED -DGREEK -DJUSTIFY -DSHAREDIR="\"/usr/share/editkit\"" -DSHAREDIR="\"\"" -o emt emt.o -L/usr/lib -lcurses
  436. emt.o: In function `ttyopen':
  437. termcap.c:(.text+0x15e): undefined reference to `tgetent'
  438. termcap.c:(.text+0x17b): undefined reference to `tgetnum'
  439. termcap.c:(.text+0x195): undefined reference to `tgetnum'
  440. termcap.c:(.text+0x1c6): undefined reference to `tgetstr'
  441. termcap.c:(.text+0x1de): undefined reference to `tgetstr'
  442. termcap.c:(.text+0x1f6): undefined reference to `tgetstr'
  443. termcap.c:(.text+0x20e): undefined reference to `tgetstr'
  444. emt.o: In function `gotoxy':
  445. termcap.c:(.text+0x381): undefined reference to `tgoto'
  446. emt.o: In function `show_rest':
  447. termcap.c:(.text+0xc89): undefined reference to `tputs'
  448. termcap.c:(.text+0xccf): undefined reference to `tputs'
  449. termcap.c:(.text+0xcec): undefined reference to `tputs'
  450. termcap.c:(.text+0xd09): undefined reference to `tputs'
  451. emt.o: In function `show_scr':
  452. termcap.c:(.text+0xe54): undefined reference to `tputs'
  453. emt.o:termcap.c:(.text+0x11b5): more undefined references to `tputs' follow
  454. collect2: error: ld returned 1 exit status
  455. Makefile.kit:40: recipe for target 'emt' failed
  456. make[1]: *** [emt] Error 1
  457. make[1]: *** Waiting for unfinished jobs....
  458. make[1]: Leaving directory '/tmp/portage/x11-misc/xrmap-2.33-r1/work/xrmap-2.33/editkit'
  459. Makefile:23: recipe for target 'all' failed
  460. make: *** [all] Error 2
  461. emake failed
  462. * ERROR: x11-misc/xrmap-2.33-r1::gentoo failed (compile phase):
  463. * (no error message)
  464. *
  465. * Call stack:
  466. * ebuild.sh, line 93: Called src_compile
  467. * environment, line 2104: Called die
  468. * The specific snippet of code:
  469. * emake HTML_VIEWER="xdg-open" || die;
  470. *
  471. * If you need support, post the output of `emerge --info '=x11-misc/xrmap-2.33-r1::gentoo'`,
  472. * the complete build log and the output of `emerge -pqv '=x11-misc/xrmap-2.33-r1::gentoo'`.
  473. sed: couldn't open temporary file /etc/portage/package.mask/sedNS4HR2: Permission denied
  474. nc6: using stream socket