1. * Package: sci-mathematics/reduce-20110414-r1
  2. * Repository: gentoo
  3. * Maintainer: grozin@gentoo.org sci-mathematics@gentoo.org
  4. * USE: abi_x86_64 amd64 doc elibc_glibc emacs kernel_linux test userland_GNU
  5. * FEATURES: sandbox test userpriv usersandbox
  6. Installed LAPACK for library directory lib64
  7. [1] reference *
  8. Installed BLAS for library directory lib64
  9. [1] reference *
  10. Installed CBLAS for library directory lib64
  11. [1] gsl
  12. [2] reference *
  13. >>> Unpacking source...
  14. >>> Unpacking reduce-src-20110414.tar.bz2 to /tmp/portage/sci-mathematics/reduce-20110414-r1/work
  15. >>> Source unpacked in /tmp/portage/sci-mathematics/reduce-20110414-r1/work
  16. >>> Preparing source in /tmp/portage/sci-mathematics/reduce-20110414-r1/work/reduce-20110414 ...
  17. >>> Source prepared.
  18. >>> Configuring source in /tmp/portage/sci-mathematics/reduce-20110414-r1/work/reduce-20110414 ...
  19. configure: Absolute path to source directory = /tmp/portage/sci-mathematics/reduce-20110414-r1/work/reduce-20110414
  20. checking build system type... x86_64-unknown-linux-gnu
  21. checking host system type... x86_64-unknown-linux-gnu
  22. in-place build attempt = yes
  23. configure: host=x86_64-unknown-linux-gnu args= '--with-csl' '--without-gui'
  24. configure: Will build in the x86_64-unknown-linux-gnu-nogui subdirectory
  25. configure: +++ Will build in /tmp/portage/sci-mathematics/reduce-20110414-r1/work/reduce-20110414/cslbuild/x86_64-unknown-linux-gnu-nogui
  26. configure: passcc =
  27. configure: doconfig = /bin/sh /tmp/portage/sci-mathematics/reduce-20110414-r1/work/reduce-20110414/configure '--with-csl' '--without-gui' CPPFLAGS="" CFLAGS="-O2 -pipe -ggdb -march=native -ftracer -frecord-gcc-switches" CXXFLAGS="-O2 -pipe -ggdb -march=native -ftracer -frecord-gcc-switches" LDFLAGS="-Wl,-O1 -Wl,--as-needed" --with-build=x86_64-unknown-linux-gnu-nogui --with-pslbuild=x86_64-unknown-linux-gnu
  28. configure: Absolute path to source directory = /tmp/portage/sci-mathematics/reduce-20110414-r1/work/reduce-20110414
  29. checking build system type... x86_64-unknown-linux-gnu
  30. checking host system type... x86_64-unknown-linux-gnu
  31. in-place build attempt = no
  32. configure: host=x86_64-unknown-linux-gnu args= '--with-csl' '--without-gui' 'CPPFLAGS=' 'CFLAGS=-O2 -pipe -ggdb -march=native -ftracer -frecord-gcc-switches' 'CXXFLAGS=-O2 -pipe -ggdb -march=native -ftracer -frecord-gcc-switches' 'LDFLAGS=-Wl,-O1 -Wl,--as-needed' '--with-build=x86_64-unknown-linux-gnu-nogui' '--with-pslbuild=x86_64-unknown-linux-gnu'
  33. configure: Will build in the x86_64-unknown-linux-gnu-nogui subdirectory
  34. configure: +++ standard build case, srcdir = /tmp/portage/sci-mathematics/reduce-20110414-r1/work/reduce-20110414 = /tmp/portage/sci-mathematics/reduce-20110414-r1/work/reduce-20110414
  35. checking for a BSD-compatible install... /usr/bin/install -c
  36. checking whether build environment is sane... yes
  37. checking for a thread-safe mkdir -p... /bin/mkdir -p
  38. checking for gawk... gawk
  39. checking whether make sets $(MAKE)... yes
  40. configure: About to configure CSL core
  41. configure: with_fox=no, with_wx=no
  42. configure: with_cygwin=no sethost=--host=x86_64-unknown-linux-gnu
  43. configure: /bin/sh /tmp/portage/sci-mathematics/reduce-20110414-r1/work/reduce-20110414/csl/cslbase/configure '--with-csl' '--without-gui' 'CPPFLAGS=' 'CFLAGS=-O2 -pipe -ggdb -march=native -ftracer -frecord-gcc-switches' 'CXXFLAGS=-O2 -pipe -ggdb -march=native -ftracer -frecord-gcc-switches' 'LDFLAGS=-Wl,-O1 -Wl,--as-needed' '--with-build=x86_64-unknown-linux-gnu-nogui' '--with-pslbuild=x86_64-unknown-linux-gnu' --host=x86_64-unknown-linux-gnu --with-build=x86_64-unknown-linux-gnu-nogui --without-fox --without-wx
  44. configure: WARNING: if you wanted to set the --build type, don't use --host.
  45. If a cross compiler is detected then cross compile mode will be used
  46. checking for a BSD-compatible install... /usr/bin/install -c
  47. checking whether build environment is sane... yes
  48. checking for x86_64-unknown-linux-gnu-strip... no
  49. checking for strip... strip
  50. checking for a thread-safe mkdir -p... /bin/mkdir -p
  51. checking for gawk... gawk
  52. checking whether make sets $(MAKE)... yes
  53. checking build system type... x86_64-unknown-linux-gnu
  54. checking host system type... x86_64-unknown-linux-gnu
  55. configure: Build platform specified as x86_64-unknown-linux-gnu-nogui
  56. configure: --with-fox=no
  57. configure: --with-wx=no
  58. checking for x86_64-unknown-linux-gnu-windres... no
  59. checking for windres... no
  60. configure: host=x86_64-unknown-linux-gnu
  61. configure: Assuming a Unix-like environment, including Linux
  62. configure: host=x86_64-unknown-linux-gnu, target=
  63. checking for gmake... gmake
  64. checking for gar... no
  65. checking for ar... ar
  66. checking for gsed... no
  67. checking for sed... sed
  68. configure: --with-fox-pending=no
  69. configure: distrib = unknown
  70. checking for debugging... no
  71. configure: foxdir =
  72. checking for conservative... no
  73. checking for test... no
  74. checking for embedded... no
  75. configure: Looking for C pre-processor
  76. checking for style of include used by gmake... GNU
  77. checking for x86_64-unknown-linux-gnu-gcc... no
  78. checking for gcc... gcc
  79. checking whether the C compiler works... yes
  80. checking for C compiler default output file name... a.out
  81. checking for suffix of executables...
  82. checking whether we are cross compiling... no
  83. checking for suffix of object files... o
  84. checking whether we are using the GNU C compiler... yes
  85. checking whether gcc accepts -g... yes
  86. checking for gcc option to accept ISO C89... none needed
  87. checking dependency style of gcc... gcc3
  88. checking how to run the C preprocessor... gcc -E
  89. configure: Looking for C compiler
  90. checking for x86_64-unknown-linux-gnu-gcc... gcc
  91. checking whether we are using the GNU C compiler... (cached) yes
  92. checking whether gcc accepts -g... (cached) yes
  93. checking for gcc option to accept ISO C89... (cached) none needed
  94. checking dependency style of gcc... (cached) gcc3
  95. checking whether gcc and cc understand -c and -o together... yes
  96. configure: Looking for C++ pre-processor
  97. checking for x86_64-unknown-linux-gnu-g++... no
  98. checking for x86_64-unknown-linux-gnu-c++... no
  99. checking for x86_64-unknown-linux-gnu-gpp... no
  100. checking for x86_64-unknown-linux-gnu-aCC... no
  101. checking for x86_64-unknown-linux-gnu-CC... no
  102. checking for x86_64-unknown-linux-gnu-cxx... no
  103. checking for x86_64-unknown-linux-gnu-cc++... no
  104. checking for x86_64-unknown-linux-gnu-cl.exe... no
  105. checking for x86_64-unknown-linux-gnu-FCC... no
  106. checking for x86_64-unknown-linux-gnu-KCC... no
  107. checking for x86_64-unknown-linux-gnu-RCC... no
  108. checking for x86_64-unknown-linux-gnu-xlC_r... no
  109. checking for x86_64-unknown-linux-gnu-xlC... no
  110. checking for g++... g++
  111. checking whether we are using the GNU C++ compiler... yes
  112. checking whether g++ accepts -g... yes
  113. checking dependency style of g++... gcc3
  114. checking how to run the C++ preprocessor... g++ -E
  115. configure: Looking for C++ compiler
  116. checking whether we are using the GNU C++ compiler... (cached) yes
  117. checking whether g++ accepts -g... (cached) yes
  118. checking dependency style of g++... (cached) gcc3
  119. configure: Checking for "--hash-style=both"
  120. configure: Will use --hash-style=both
  121. configure: Checking for "-rdynamic"
  122. configure: rdynamic=yes
  123. configure: Checking for "-fPIC"
  124. configure: -fPIC=yes
  125. checking whether ln -s works... yes
  126. checking for JIT support... no
  127. checking for static linking... no
  128. checking for dlopen in -ldl... yes
  129. checking for clock_nanosleep in -lrt... yes
  130. checking for pthread_create in -lpthread... yes
  131. checking termios.h usability... yes
  132. checking termios.h presence... yes
  133. checking for termios.h... yes
  134. checking sys/ioctl.h usability... yes
  135. checking sys/ioctl.h presence... yes
  136. checking for sys/ioctl.h... yes
  137. checking curses.h usability... yes
  138. checking curses.h presence... yes
  139. checking for curses.h... yes
  140. checking ncurses.h usability... yes
  141. checking ncurses.h presence... yes
  142. checking for ncurses.h... yes
  143. configure: curses= ncurses=
  144. checking for tgetent in -lcurses... no
  145. checking for tgetent in -lncurses... no
  146. checking for term.h... yes
  147. checking for ncurses/term.h... no
  148. checking for tgetent... no
  149. checking for tputs... no
  150. checking for cfmakeraw... yes
  151. checking for dirent.h that defines DIR... yes
  152. checking for library containing opendir... none required
  153. checking for sys/wait.h that is POSIX.1 compatible... yes
  154. checking stdint.h usability... yes
  155. checking stdint.h presence... yes
  156. checking for stdint.h... yes
  157. configure: stdint_header=y
  158. checking inttypes.h usability... yes
  159. checking inttypes.h presence... yes
  160. checking for inttypes.h... yes
  161. configure: inttypes_header=y
  162. checking fcntl.h usability... yes
  163. checking fcntl.h presence... yes
  164. checking for fcntl.h... yes
  165. checking float.h usability... yes
  166. checking float.h presence... yes
  167. checking for float.h... yes
  168. checking malloc.h usability... yes
  169. checking malloc.h presence... yes
  170. checking for malloc.h... yes
  171. checking memory.h usability... yes
  172. checking memory.h presence... yes
  173. checking for memory.h... yes
  174. checking stddef.h usability... yes
  175. checking stddef.h presence... yes
  176. checking for stddef.h... yes
  177. checking stdlib.h usability... yes
  178. checking stdlib.h presence... yes
  179. checking for stdlib.h... yes
  180. checking string.h usability... yes
  181. checking string.h presence... yes
  182. checking for string.h... yes
  183. checking sys/param.h usability... yes
  184. checking sys/param.h presence... yes
  185. checking for sys/param.h... yes
  186. checking sys/time.h usability... yes
  187. checking sys/time.h presence... yes
  188. checking for sys/time.h... yes
  189. checking sys/times.h usability... yes
  190. checking sys/times.h presence... yes
  191. checking for sys/times.h... yes
  192. checking unistd.h usability... yes
  193. checking unistd.h presence... yes
  194. checking for unistd.h... yes
  195. checking utime.h usability... yes
  196. checking utime.h presence... yes
  197. checking for utime.h... yes
  198. checking arpa/inet.h usability... yes
  199. checking arpa/inet.h presence... yes
  200. checking for arpa/inet.h... yes
  201. checking netdb.h usability... yes
  202. checking netdb.h presence... yes
  203. checking for netdb.h... yes
  204. checking netinet/in.h usability... yes
  205. checking netinet/in.h presence... yes
  206. checking for netinet/in.h... yes
  207. checking sys/socket.h usability... yes
  208. checking sys/socket.h presence... yes
  209. checking for sys/socket.h... yes
  210. checking sys/stat.h usability... yes
  211. checking sys/stat.h presence... yes
  212. checking for sys/stat.h... yes
  213. checking sys/types.h usability... yes
  214. checking sys/types.h presence... yes
  215. checking for sys/types.h... yes
  216. checking for sys/wait.h... (cached) yes
  217. checking sys/shm.h usability... yes
  218. checking sys/shm.h presence... yes
  219. checking for sys/shm.h... yes
  220. checking sys/ipc.h usability... yes
  221. checking sys/ipc.h presence... yes
  222. checking for sys/ipc.h... yes
  223. checking signal.h usability... yes
  224. checking signal.h presence... yes
  225. checking for signal.h... yes
  226. checking setjmp.h usability... yes
  227. checking setjmp.h presence... yes
  228. checking for setjmp.h... yes
  229. checking sys/sysctl.h usability... yes
  230. checking sys/sysctl.h presence... yes
  231. checking for sys/sysctl.h... yes
  232. checking syscall.h usability... yes
  233. checking syscall.h presence... yes
  234. checking for syscall.h... yes
  235. checking sched.h usability... yes
  236. checking sched.h presence... yes
  237. checking for sched.h... yes
  238. checking for cpu_set_t... yes
  239. checking whether stat file-mode macros are broken... no
  240. checking for an ANSI C-conforming const... yes
  241. checking whether struct tm is in sys/time.h or time.h... time.h
  242. checking for working volatile... yes
  243. checking for int8_t... yes
  244. checking for int16_t... yes
  245. checking for int32_t... yes
  246. checking for int64_t... yes
  247. checking for intptr_t... yes
  248. checking for uint8_t... yes
  249. checking for uint16_t... yes
  250. checking for uint32_t... yes
  251. checking for uint64_t... yes
  252. checking for uintptr_t... yes
  253. checking for u_int8_t... no
  254. checking for u_int16_t... no
  255. checking for u_int32_t... no
  256. checking for u_int64_t... no
  257. checking for u_intptr_t... no
  258. checking for socklen_t... yes
  259. checking for socket in -lsocket... no
  260. checking for gethostbyname in -lnsl... yes
  261. checking whether closedir returns void... no
  262. checking for error_at_line... yes
  263. checking whether lstat correctly handles trailing slash... yes
  264. checking whether lstat accepts an empty string... no
  265. checking whether lstat correctly handles trailing slash... (cached) yes
  266. checking for working memcmp... yes
  267. checking return type of signal handlers... void
  268. checking whether stat accepts an empty string... no
  269. checking for utime.h... (cached) yes
  270. checking whether utime accepts a null argument... yes
  271. checking for vprintf... yes
  272. checking for _doprnt... no
  273. checking for atexit... yes
  274. checking for ftruncate... yes
  275. checking for getcwd... yes
  276. checking for gethostbyaddr... yes
  277. checking for gethostbyname... yes
  278. checking for inet_ntoa... yes
  279. checking for memmove... yes
  280. checking for memset... yes
  281. checking for mkdir... yes
  282. checking for pow... no
  283. checking for rmdir... yes
  284. checking for socket... yes
  285. checking for sqrt... no
  286. checking for strchr... yes
  287. checking for strdup... yes
  288. checking for strrchr... yes
  289. checking for strstr... yes
  290. checking for utime... yes
  291. checking for popen... yes
  292. checking for fork... yes
  293. checking for wait... yes
  294. checking for waitpid... yes
  295. checking for shmget... yes
  296. checking for shmat... yes
  297. checking for shmdt... yes
  298. checking for shmctl... yes
  299. checking for vsnprintf... yes
  300. checking for sysctlbyname... no
  301. checking for siglongjmp... yes
  302. checking for sigaltstack... yes
  303. checking for sigaction... yes
  304. configure: sigsetjmp appears to be available
  305. configure: Can Run Executables = yes
  306. configure: Signed shifts logical status = no
  307. checking for cygpath... no
  308. configure: creating ./config.status
  309. config.status: creating Makefile
  310. config.status: creating config.h
  311. config.status: executing depfiles commands
  312. configure: final output from top level configuration
  313. configure: creating ./config.status
  314. config.status: creating Makefile
  315. >>> Source configured.
  316. >>> Compiling source in /tmp/portage/sci-mathematics/reduce-20110414-r1/work/reduce-20110414 ...
  317. make -j24 -j1 STRIP=true
  318. /bin/sh scripts/make.sh
  319. Current machine tag is x86_64-unknown-linux-gnu
  320. About to build in cslbuild/x86_64-unknown-linux-gnu-nogui
  321. /usr/bin/gmake MYFLAGS= --no-print-directory
  322. cd /tmp/portage/sci-mathematics/reduce-20110414-r1/work/reduce-20110414 && /bin/sh /tmp/portage/sci-mathematics/reduce-20110414-r1/work/reduce-20110414/missing --run aclocal-1.10
  323. main::scan_file() called too early to check prototype at /usr/bin/aclocal-1.10 line 616.
  324. /usr/share/aclocal/sdlmm.m4:12: warning: underquoted definition of AM_PATH_SDLMM
  325. /usr/share/aclocal/sdlmm.m4:12: run info '(automake)Extending aclocal'
  326. /usr/share/aclocal/sdlmm.m4:12: or see http://sources.redhat.com/automake/automake.html#Extending-aclocal
  327. cd /tmp/portage/sci-mathematics/reduce-20110414-r1/work/reduce-20110414 && /bin/sh /tmp/portage/sci-mathematics/reduce-20110414-r1/work/reduce-20110414/missing --run automake-1.10 --foreign
  328. cd /tmp/portage/sci-mathematics/reduce-20110414-r1/work/reduce-20110414 && /bin/sh /tmp/portage/sci-mathematics/reduce-20110414-r1/work/reduce-20110414/missing --run autoconf
  329. /bin/sh ./config.status --recheck
  330. running CONFIG_SHELL=/bin/sh /bin/sh /tmp/portage/sci-mathematics/reduce-20110414-r1/work/reduce-20110414/configure --with-csl --without-gui CPPFLAGS= CFLAGS=-O2 -pipe -ggdb -march=native -ftracer -frecord-gcc-switches CXXFLAGS=-O2 -pipe -ggdb -march=native -ftracer -frecord-gcc-switches LDFLAGS=-Wl,-O1 -Wl,--as-needed --with-build=x86_64-unknown-linux-gnu-nogui --with-pslbuild=x86_64-unknown-linux-gnu --no-create --no-recursion
  331. configure: Absolute path to source directory = /tmp/portage/sci-mathematics/reduce-20110414-r1/work/reduce-20110414
  332. checking build system type... x86_64-unknown-linux-gnu
  333. checking host system type... x86_64-unknown-linux-gnu
  334. in-place build attempt = no
  335. configure: host=x86_64-unknown-linux-gnu args= '--with-csl' '--without-gui' 'CPPFLAGS=' 'CFLAGS=-O2 -pipe -ggdb -march=native -ftracer -frecord-gcc-switches' 'CXXFLAGS=-O2 -pipe -ggdb -march=native -ftracer -frecord-gcc-switches' 'LDFLAGS=-Wl,-O1 -Wl,--as-needed' '--with-build=x86_64-unknown-linux-gnu-nogui' '--with-pslbuild=x86_64-unknown-linux-gnu'
  336. configure: Will build in the x86_64-unknown-linux-gnu-nogui subdirectory
  337. configure: +++ standard build case, srcdir = /tmp/portage/sci-mathematics/reduce-20110414-r1/work/reduce-20110414 = /tmp/portage/sci-mathematics/reduce-20110414-r1/work/reduce-20110414
  338. checking for a BSD-compatible install... /usr/bin/install -c
  339. checking whether build environment is sane... yes
  340. checking for a thread-safe mkdir -p... /bin/mkdir -p
  341. checking for gawk... gawk
  342. checking whether /usr/bin/gmake sets $(MAKE)... yes
  343. configure: About to configure CSL core
  344. configure: with_fox=no, with_wx=no
  345. configure: with_cygwin=no sethost=--host=x86_64-unknown-linux-gnu
  346. configure: /bin/sh /tmp/portage/sci-mathematics/reduce-20110414-r1/work/reduce-20110414/csl/cslbase/configure '--with-csl' '--without-gui' 'CPPFLAGS=' 'CFLAGS=-O2 -pipe -ggdb -march=native -ftracer -frecord-gcc-switches' 'CXXFLAGS=-O2 -pipe -ggdb -march=native -ftracer -frecord-gcc-switches' 'LDFLAGS=-Wl,-O1 -Wl,--as-needed' '--with-build=x86_64-unknown-linux-gnu-nogui' '--with-pslbuild=x86_64-unknown-linux-gnu' --host=x86_64-unknown-linux-gnu --with-build=x86_64-unknown-linux-gnu-nogui --without-fox --without-wx
  347. configure: WARNING: if you wanted to set the --build type, don't use --host.
  348. If a cross compiler is detected then cross compile mode will be used
  349. checking for a BSD-compatible install... /usr/bin/install -c
  350. checking whether build environment is sane... yes
  351. checking for x86_64-unknown-linux-gnu-strip... true
  352. checking for a thread-safe mkdir -p... /bin/mkdir -p
  353. checking for gawk... gawk
  354. checking whether /usr/bin/gmake sets $(MAKE)... yes
  355. checking build system type... x86_64-unknown-linux-gnu
  356. checking host system type... x86_64-unknown-linux-gnu
  357. configure: Build platform specified as x86_64-unknown-linux-gnu-nogui
  358. configure: --with-fox=no
  359. configure: --with-wx=no
  360. checking for x86_64-unknown-linux-gnu-windres... no
  361. checking for windres... no
  362. configure: host=x86_64-unknown-linux-gnu
  363. configure: Assuming a Unix-like environment, including Linux
  364. configure: host=x86_64-unknown-linux-gnu, target=
  365. checking for gar... no
  366. checking for ar... ar
  367. checking for gsed... no
  368. checking for sed... sed
  369. configure: --with-fox-pending=no
  370. configure: distrib = unknown
  371. checking for debugging... no
  372. configure: foxdir =
  373. checking for conservative... no
  374. checking for test... no
  375. checking for embedded... no
  376. configure: Looking for C pre-processor
  377. checking for style of include used by /usr/bin/gmake... GNU
  378. checking for x86_64-unknown-linux-gnu-gcc... no
  379. checking for gcc... gcc
  380. checking whether the C compiler works... yes
  381. checking for C compiler default output file name... a.out
  382. checking for suffix of executables...
  383. checking whether we are cross compiling... no
  384. checking for suffix of object files... o
  385. checking whether we are using the GNU C compiler... yes
  386. checking whether gcc accepts -g... yes
  387. checking for gcc option to accept ISO C89... none needed
  388. checking dependency style of gcc... gcc3
  389. checking how to run the C preprocessor... gcc -E
  390. configure: Looking for C compiler
  391. checking for x86_64-unknown-linux-gnu-gcc... gcc
  392. checking whether we are using the GNU C compiler... (cached) yes
  393. checking whether gcc accepts -g... (cached) yes
  394. checking for gcc option to accept ISO C89... (cached) none needed
  395. checking dependency style of gcc... (cached) gcc3
  396. checking whether gcc and cc understand -c and -o together... yes
  397. configure: Looking for C++ pre-processor
  398. checking for x86_64-unknown-linux-gnu-g++... no
  399. checking for x86_64-unknown-linux-gnu-c++... no
  400. checking for x86_64-unknown-linux-gnu-gpp... no
  401. checking for x86_64-unknown-linux-gnu-aCC... no
  402. checking for x86_64-unknown-linux-gnu-CC... no
  403. checking for x86_64-unknown-linux-gnu-cxx... no
  404. checking for x86_64-unknown-linux-gnu-cc++... no
  405. checking for x86_64-unknown-linux-gnu-cl.exe... no
  406. checking for x86_64-unknown-linux-gnu-FCC... no
  407. checking for x86_64-unknown-linux-gnu-KCC... no
  408. checking for x86_64-unknown-linux-gnu-RCC... no
  409. checking for x86_64-unknown-linux-gnu-xlC_r... no
  410. checking for x86_64-unknown-linux-gnu-xlC... no
  411. checking for g++... g++
  412. checking whether we are using the GNU C++ compiler... yes
  413. checking whether g++ accepts -g... yes
  414. checking dependency style of g++... gcc3
  415. checking how to run the C++ preprocessor... g++ -E
  416. configure: Looking for C++ compiler
  417. checking whether we are using the GNU C++ compiler... (cached) yes
  418. checking whether g++ accepts -g... (cached) yes
  419. checking dependency style of g++... (cached) gcc3
  420. configure: Checking for "--hash-style=both"
  421. configure: Will use --hash-style=both
  422. configure: Checking for "-rdynamic"
  423. configure: rdynamic=yes
  424. configure: Checking for "-fPIC"
  425. configure: -fPIC=yes
  426. checking whether ln -s works... yes
  427. checking for JIT support... no
  428. checking for static linking... no
  429. checking for dlopen in -ldl... yes
  430. checking for clock_nanosleep in -lrt... yes
  431. checking for pthread_create in -lpthread... yes
  432. checking termios.h usability... yes
  433. checking termios.h presence... yes
  434. checking for termios.h... yes
  435. checking sys/ioctl.h usability... yes
  436. checking sys/ioctl.h presence... yes
  437. checking for sys/ioctl.h... yes
  438. checking curses.h usability... yes
  439. checking curses.h presence... yes
  440. checking for curses.h... yes
  441. checking ncurses.h usability... yes
  442. checking ncurses.h presence... yes
  443. checking for ncurses.h... yes
  444. configure: curses= ncurses=
  445. checking for tgetent in -lcurses... no
  446. checking for tgetent in -lncurses... no
  447. checking for term.h... yes
  448. checking for ncurses/term.h... no
  449. checking for tgetent... no
  450. checking for tputs... no
  451. checking for cfmakeraw... yes
  452. checking for dirent.h that defines DIR... yes
  453. checking for library containing opendir... none required
  454. checking for sys/wait.h that is POSIX.1 compatible... yes
  455. checking stdint.h usability... yes
  456. checking stdint.h presence... yes
  457. checking for stdint.h... yes
  458. configure: stdint_header=y
  459. checking inttypes.h usability... yes
  460. checking inttypes.h presence... yes
  461. checking for inttypes.h... yes
  462. configure: inttypes_header=y
  463. checking fcntl.h usability... yes
  464. checking fcntl.h presence... yes
  465. checking for fcntl.h... yes
  466. checking float.h usability... yes
  467. checking float.h presence... yes
  468. checking for float.h... yes
  469. checking malloc.h usability... yes
  470. checking malloc.h presence... yes
  471. checking for malloc.h... yes
  472. checking memory.h usability... yes
  473. checking memory.h presence... yes
  474. checking for memory.h... yes
  475. checking stddef.h usability... yes
  476. checking stddef.h presence... yes
  477. checking for stddef.h... yes
  478. checking stdlib.h usability... yes
  479. checking stdlib.h presence... yes
  480. checking for stdlib.h... yes
  481. checking string.h usability... yes
  482. checking string.h presence... yes
  483. checking for string.h... yes
  484. checking sys/param.h usability... yes
  485. checking sys/param.h presence... yes
  486. checking for sys/param.h... yes
  487. checking sys/time.h usability... yes
  488. checking sys/time.h presence... yes
  489. checking for sys/time.h... yes
  490. checking sys/times.h usability... yes
  491. checking sys/times.h presence... yes
  492. checking for sys/times.h... yes
  493. checking unistd.h usability... yes
  494. checking unistd.h presence... yes
  495. checking for unistd.h... yes
  496. checking utime.h usability... yes
  497. checking utime.h presence... yes
  498. checking for utime.h... yes
  499. checking arpa/inet.h usability... yes
  500. checking arpa/inet.h presence... yes
  501. checking for arpa/inet.h... yes
  502. checking netdb.h usability... yes
  503. checking netdb.h presence... yes
  504. checking for netdb.h... yes
  505. checking netinet/in.h usability... yes
  506. checking netinet/in.h presence... yes
  507. checking for netinet/in.h... yes
  508. checking sys/socket.h usability... yes
  509. checking sys/socket.h presence... yes
  510. checking for sys/socket.h... yes
  511. checking sys/stat.h usability... yes
  512. checking sys/stat.h presence... yes
  513. checking for sys/stat.h... yes
  514. checking sys/types.h usability... yes
  515. checking sys/types.h presence... yes
  516. checking for sys/types.h... yes
  517. checking for sys/wait.h... (cached) yes
  518. checking sys/shm.h usability... yes
  519. checking sys/shm.h presence... yes
  520. checking for sys/shm.h... yes
  521. checking sys/ipc.h usability... yes
  522. checking sys/ipc.h presence... yes
  523. checking for sys/ipc.h... yes
  524. checking signal.h usability... yes
  525. checking signal.h presence... yes
  526. checking for signal.h... yes
  527. checking setjmp.h usability... yes
  528. checking setjmp.h presence... yes
  529. checking for setjmp.h... yes
  530. checking sys/sysctl.h usability... yes
  531. checking sys/sysctl.h presence... yes
  532. checking for sys/sysctl.h... yes
  533. checking syscall.h usability... yes
  534. checking syscall.h presence... yes
  535. checking for syscall.h... yes
  536. checking sched.h usability... yes
  537. checking sched.h presence... yes
  538. checking for sched.h... yes
  539. checking for cpu_set_t... yes
  540. checking whether stat file-mode macros are broken... no
  541. checking for an ANSI C-conforming const... yes
  542. checking whether struct tm is in sys/time.h or time.h... time.h
  543. checking for working volatile... yes
  544. checking for int8_t... yes
  545. checking for int16_t... yes
  546. checking for int32_t... yes
  547. checking for int64_t... yes
  548. checking for intptr_t... yes
  549. checking for uint8_t... yes
  550. checking for uint16_t... yes
  551. checking for uint32_t... yes
  552. checking for uint64_t... yes
  553. checking for uintptr_t... yes
  554. checking for u_int8_t... no
  555. checking for u_int16_t... no
  556. checking for u_int32_t... no
  557. checking for u_int64_t... no
  558. checking for u_intptr_t... no
  559. checking for socklen_t... yes
  560. checking for socket in -lsocket... no
  561. checking for gethostbyname in -lnsl... yes
  562. checking whether closedir returns void... no
  563. checking for error_at_line... yes
  564. checking whether lstat correctly handles trailing slash... yes
  565. checking whether lstat accepts an empty string... no
  566. checking whether lstat correctly handles trailing slash... (cached) yes
  567. checking for working memcmp... yes
  568. checking return type of signal handlers... void
  569. checking whether stat accepts an empty string... no
  570. checking for utime.h... (cached) yes
  571. checking whether utime accepts a null argument... yes
  572. checking for vprintf... yes
  573. checking for _doprnt... no
  574. checking for atexit... yes
  575. checking for ftruncate... yes
  576. checking for getcwd... yes
  577. checking for gethostbyaddr... yes
  578. checking for gethostbyname... yes
  579. checking for inet_ntoa... yes
  580. checking for memmove... yes
  581. checking for memset... yes
  582. checking for mkdir... yes
  583. checking for pow... no
  584. checking for rmdir... yes
  585. checking for socket... yes
  586. checking for sqrt... no
  587. checking for strchr... yes
  588. checking for strdup... yes
  589. checking for strrchr... yes
  590. checking for strstr... yes
  591. checking for utime... yes
  592. checking for popen... yes
  593. checking for fork... yes
  594. checking for wait... yes
  595. checking for waitpid... yes
  596. checking for shmget... yes
  597. checking for shmat... yes
  598. checking for shmdt... yes
  599. checking for shmctl... yes
  600. checking for vsnprintf... yes
  601. checking for sysctlbyname... no
  602. checking for siglongjmp... yes
  603. checking for sigaltstack... yes
  604. checking for sigaction... yes
  605. configure: sigsetjmp appears to be available
  606. configure: Can Run Executables = yes
  607. configure: Signed shifts logical status = no
  608. checking for cygpath... no
  609. configure: creating ./config.status
  610. config.status: creating Makefile
  611. config.status: creating config.h
  612. config.status: config.h is unchanged
  613. config.status: executing depfiles commands
  614. configure: final output from top level configuration
  615. configure: creating ./config.status
  616. /bin/sh ./config.status
  617. config.status: creating Makefile
  618. echo Build all: /usr/bin/gmake mflags=--no-print-directory myflags= all
  619. Build all: /usr/bin/gmake mflags=--no-print-directory myflags= all
  620. touch csl.dep
  621. touch bootstrapreduce.dep
  622. touch reduce.dep
  623. cd /tmp/portage/sci-mathematics/reduce-20110414-r1/work/reduce-20110414/csl/cslbase && /bin/sh /tmp/portage/sci-mathematics/reduce-20110414-r1/work/reduce-20110414/csl/cslbase/missing --run aclocal-1.10
  624. main::scan_file() called too early to check prototype at /usr/bin/aclocal-1.10 line 616.
  625. /usr/share/aclocal/sdlmm.m4:12: warning: underquoted definition of AM_PATH_SDLMM
  626. /usr/share/aclocal/sdlmm.m4:12: run info '(automake)Extending aclocal'
  627. /usr/share/aclocal/sdlmm.m4:12: or see http://sources.redhat.com/automake/automake.html#Extending-aclocal
  628. cd /tmp/portage/sci-mathematics/reduce-20110414-r1/work/reduce-20110414/csl/cslbase && /bin/sh /tmp/portage/sci-mathematics/reduce-20110414-r1/work/reduce-20110414/csl/cslbase/missing --run automake-1.10 --foreign
  629. cd /tmp/portage/sci-mathematics/reduce-20110414-r1/work/reduce-20110414/csl/cslbase && /bin/sh /tmp/portage/sci-mathematics/reduce-20110414-r1/work/reduce-20110414/csl/cslbase/missing --run autoconf
  630. /bin/sh ./config.status --recheck
  631. running CONFIG_SHELL=/bin/sh /bin/sh /tmp/portage/sci-mathematics/reduce-20110414-r1/work/reduce-20110414/csl/cslbase/configure --with-csl --without-gui CPPFLAGS= CFLAGS=-O2 -pipe -ggdb -march=native -ftracer -frecord-gcc-switches CXXFLAGS=-O2 -pipe -ggdb -march=native -ftracer -frecord-gcc-switches LDFLAGS=-Wl,-O1 -Wl,--as-needed --with-pslbuild=x86_64-unknown-linux-gnu --host=x86_64-unknown-linux-gnu --with-build=x86_64-unknown-linux-gnu-nogui --without-fox --without-wx host_alias=x86_64-unknown-linux-gnu --no-create --no-recursion
  632. checking for a BSD-compatible install... /usr/bin/install -c
  633. checking whether build environment is sane... yes
  634. checking for x86_64-unknown-linux-gnu-strip... true
  635. checking for a thread-safe mkdir -p... /bin/mkdir -p
  636. checking for gawk... gawk
  637. checking whether /usr/bin/gmake sets $(MAKE)... yes
  638. checking build system type... x86_64-unknown-linux-gnu
  639. checking host system type... x86_64-unknown-linux-gnu
  640. configure: Build platform specified as x86_64-unknown-linux-gnu-nogui
  641. configure: --with-fox=no
  642. configure: --with-wx=no
  643. checking for x86_64-unknown-linux-gnu-windres... no
  644. checking for windres... no
  645. configure: host=x86_64-unknown-linux-gnu
  646. configure: Assuming a Unix-like environment, including Linux
  647. configure: host=x86_64-unknown-linux-gnu, target=
  648. checking for gar... no
  649. checking for ar... ar
  650. checking for gsed... no
  651. checking for sed... sed
  652. configure: --with-fox-pending=no
  653. configure: distrib = unknown
  654. checking for debugging... no
  655. configure: foxdir =
  656. checking for conservative... no
  657. checking for test... no
  658. checking for embedded... no
  659. configure: Looking for C pre-processor
  660. checking for style of include used by /usr/bin/gmake... GNU
  661. checking for x86_64-unknown-linux-gnu-gcc... no
  662. checking for gcc... gcc
  663. checking whether the C compiler works... yes
  664. checking for C compiler default output file name... a.out
  665. checking for suffix of executables...
  666. checking whether we are cross compiling... no
  667. checking for suffix of object files... o
  668. checking whether we are using the GNU C compiler... yes
  669. checking whether gcc accepts -g... yes
  670. checking for gcc option to accept ISO C89... none needed
  671. checking dependency style of gcc... gcc3
  672. checking how to run the C preprocessor... gcc -E
  673. configure: Looking for C compiler
  674. checking for x86_64-unknown-linux-gnu-gcc... gcc
  675. checking whether we are using the GNU C compiler... (cached) yes
  676. checking whether gcc accepts -g... (cached) yes
  677. checking for gcc option to accept ISO C89... (cached) none needed
  678. checking dependency style of gcc... (cached) gcc3
  679. checking whether gcc and cc understand -c and -o together... yes
  680. configure: Looking for C++ pre-processor
  681. checking for x86_64-unknown-linux-gnu-g++... no
  682. checking for x86_64-unknown-linux-gnu-c++... no
  683. checking for x86_64-unknown-linux-gnu-gpp... no
  684. checking for x86_64-unknown-linux-gnu-aCC... no
  685. checking for x86_64-unknown-linux-gnu-CC... no
  686. checking for x86_64-unknown-linux-gnu-cxx... no
  687. checking for x86_64-unknown-linux-gnu-cc++... no
  688. checking for x86_64-unknown-linux-gnu-cl.exe... no
  689. checking for x86_64-unknown-linux-gnu-FCC... no
  690. checking for x86_64-unknown-linux-gnu-KCC... no
  691. checking for x86_64-unknown-linux-gnu-RCC... no
  692. checking for x86_64-unknown-linux-gnu-xlC_r... no
  693. checking for x86_64-unknown-linux-gnu-xlC... no
  694. checking for g++... g++
  695. checking whether we are using the GNU C++ compiler... yes
  696. checking whether g++ accepts -g... yes
  697. checking dependency style of g++... gcc3
  698. checking how to run the C++ preprocessor... g++ -E
  699. configure: Looking for C++ compiler
  700. checking whether we are using the GNU C++ compiler... (cached) yes
  701. checking whether g++ accepts -g... (cached) yes
  702. checking dependency style of g++... (cached) gcc3
  703. configure: Checking for "--hash-style=both"
  704. configure: Will use --hash-style=both
  705. configure: Checking for "-rdynamic"
  706. configure: rdynamic=yes
  707. configure: Checking for "-fPIC"
  708. configure: -fPIC=yes
  709. checking whether ln -s works... yes
  710. checking for JIT support... no
  711. checking for static linking... no
  712. checking for dlopen in -ldl... yes
  713. checking for clock_nanosleep in -lrt... yes
  714. checking for pthread_create in -lpthread... yes
  715. checking termios.h usability... yes
  716. checking termios.h presence... yes
  717. checking for termios.h... yes
  718. checking sys/ioctl.h usability... yes
  719. checking sys/ioctl.h presence... yes
  720. checking for sys/ioctl.h... yes
  721. checking curses.h usability... yes
  722. checking curses.h presence... yes
  723. checking for curses.h... yes
  724. checking ncurses.h usability... yes
  725. checking ncurses.h presence... yes
  726. checking for ncurses.h... yes
  727. configure: curses= ncurses=
  728. checking for tgetent in -lcurses... no
  729. checking for tgetent in -lncurses... no
  730. checking for term.h... yes
  731. checking for ncurses/term.h... no
  732. checking for tgetent... no
  733. checking for tputs... no
  734. checking for cfmakeraw... yes
  735. checking for dirent.h that defines DIR... yes
  736. checking for library containing opendir... none required
  737. checking for sys/wait.h that is POSIX.1 compatible... yes
  738. checking stdint.h usability... yes
  739. checking stdint.h presence... yes
  740. checking for stdint.h... yes
  741. configure: stdint_header=y
  742. checking inttypes.h usability... yes
  743. checking inttypes.h presence... yes
  744. checking for inttypes.h... yes
  745. configure: inttypes_header=y
  746. checking fcntl.h usability... yes
  747. checking fcntl.h presence... yes
  748. checking for fcntl.h... yes
  749. checking float.h usability... yes
  750. checking float.h presence... yes
  751. checking for float.h... yes
  752. checking malloc.h usability... yes
  753. checking malloc.h presence... yes
  754. checking for malloc.h... yes
  755. checking memory.h usability... yes
  756. checking memory.h presence... yes
  757. checking for memory.h... yes
  758. checking stddef.h usability... yes
  759. checking stddef.h presence... yes
  760. checking for stddef.h... yes
  761. checking stdlib.h usability... yes
  762. checking stdlib.h presence... yes
  763. checking for stdlib.h... yes
  764. checking string.h usability... yes
  765. checking string.h presence... yes
  766. checking for string.h... yes
  767. checking sys/param.h usability... yes
  768. checking sys/param.h presence... yes
  769. checking for sys/param.h... yes
  770. checking sys/time.h usability... yes
  771. checking sys/time.h presence... yes
  772. checking for sys/time.h... yes
  773. checking sys/times.h usability... yes
  774. checking sys/times.h presence... yes
  775. checking for sys/times.h... yes
  776. checking unistd.h usability... yes
  777. checking unistd.h presence... yes
  778. checking for unistd.h... yes
  779. checking utime.h usability... yes
  780. checking utime.h presence... yes
  781. checking for utime.h... yes
  782. checking arpa/inet.h usability... yes
  783. checking arpa/inet.h presence... yes
  784. checking for arpa/inet.h... yes
  785. checking netdb.h usability... yes
  786. checking netdb.h presence... yes
  787. checking for netdb.h... yes
  788. checking netinet/in.h usability... yes
  789. checking netinet/in.h presence... yes
  790. checking for netinet/in.h... yes
  791. checking sys/socket.h usability... yes
  792. checking sys/socket.h presence... yes
  793. checking for sys/socket.h... yes
  794. checking sys/stat.h usability... yes
  795. checking sys/stat.h presence... yes
  796. checking for sys/stat.h... yes
  797. checking sys/types.h usability... yes
  798. checking sys/types.h presence... yes
  799. checking for sys/types.h... yes
  800. checking for sys/wait.h... (cached) yes
  801. checking sys/shm.h usability... yes
  802. checking sys/shm.h presence... yes
  803. checking for sys/shm.h... yes
  804. checking sys/ipc.h usability... yes
  805. checking sys/ipc.h presence... yes
  806. checking for sys/ipc.h... yes
  807. checking signal.h usability... yes
  808. checking signal.h presence... yes
  809. checking for signal.h... yes
  810. checking setjmp.h usability... yes
  811. checking setjmp.h presence... yes
  812. checking for setjmp.h... yes
  813. checking sys/sysctl.h usability... yes
  814. checking sys/sysctl.h presence... yes
  815. checking for sys/sysctl.h... yes
  816. checking syscall.h usability... yes
  817. checking syscall.h presence... yes
  818. checking for syscall.h... yes
  819. checking sched.h usability... yes
  820. checking sched.h presence... yes
  821. checking for sched.h... yes
  822. checking for cpu_set_t... yes
  823. checking whether stat file-mode macros are broken... no
  824. checking for an ANSI C-conforming const... yes
  825. checking whether struct tm is in sys/time.h or time.h... time.h
  826. checking for working volatile... yes
  827. checking for int8_t... yes
  828. checking for int16_t... yes
  829. checking for int32_t... yes
  830. checking for int64_t... yes
  831. checking for intptr_t... yes
  832. checking for uint8_t... yes
  833. checking for uint16_t... yes
  834. checking for uint32_t... yes
  835. checking for uint64_t... yes
  836. checking for uintptr_t... yes
  837. checking for u_int8_t... no
  838. checking for u_int16_t... no
  839. checking for u_int32_t... no
  840. checking for u_int64_t... no
  841. checking for u_intptr_t... no
  842. checking for socklen_t... yes
  843. checking for socket in -lsocket... no
  844. checking for gethostbyname in -lnsl... yes
  845. checking whether closedir returns void... no
  846. checking for error_at_line... yes
  847. checking whether lstat correctly handles trailing slash... yes
  848. checking whether lstat accepts an empty string... no
  849. checking whether lstat correctly handles trailing slash... (cached) yes
  850. checking for working memcmp... yes
  851. checking return type of signal handlers... void
  852. checking whether stat accepts an empty string... no
  853. checking for utime.h... (cached) yes
  854. checking whether utime accepts a null argument... yes
  855. checking for vprintf... yes
  856. checking for _doprnt... no
  857. checking for atexit... yes
  858. checking for ftruncate... yes
  859. checking for getcwd... yes
  860. checking for gethostbyaddr... yes
  861. checking for gethostbyname... yes
  862. checking for inet_ntoa... yes
  863. checking for memmove... yes
  864. checking for memset... yes
  865. checking for mkdir... yes
  866. checking for pow... no
  867. checking for rmdir... yes
  868. checking for socket... yes
  869. checking for sqrt... no
  870. checking for strchr... yes
  871. checking for strdup... yes
  872. checking for strrchr... yes
  873. checking for strstr... yes
  874. checking for utime... yes
  875. checking for popen... yes
  876. checking for fork... yes
  877. checking for wait... yes
  878. checking for waitpid... yes
  879. checking for shmget... yes
  880. checking for shmat... yes
  881. checking for shmdt... yes
  882. checking for shmctl... yes
  883. checking for vsnprintf... yes
  884. checking for sysctlbyname... no
  885. checking for siglongjmp... yes
  886. checking for sigaltstack... yes
  887. checking for sigaction... yes
  888. configure: sigsetjmp appears to be available
  889. configure: Can Run Executables = yes
  890. configure: Signed shifts logical status = no
  891. checking for cygpath... no
  892. configure: creating ./config.status
  893. /bin/sh ./config.status
  894. config.status: creating Makefile
  895. config.status: creating config.h
  896. config.status: config.h is unchanged
  897. config.status: executing depfiles commands
  898. cd /tmp/portage/sci-mathematics/reduce-20110414-r1/work/reduce-20110414/csl/cslbase && /bin/sh /tmp/portage/sci-mathematics/reduce-20110414-r1/work/reduce-20110414/csl/cslbase/missing --run autoheader
  899. rm -f stamp-h1
  900. touch /tmp/portage/sci-mathematics/reduce-20110414-r1/work/reduce-20110414/csl/cslbase/config.h.in
  901. cd . && /bin/sh ./config.status config.h
  902. config.status: creating config.h
  903. config.status: config.h is unchanged
  904. /usr/bin/gmake all-am
  905. gcc -DHAVE_CONFIG_H -I. -I/tmp/portage/sci-mathematics/reduce-20110414-r1/work/reduce-20110414/csl/cslbase -Dfontsdir=reduce.fonts -DBINDIR=/usr/local/bin -DPKGDATADIR=/usr/local/share/reduce -O2 -pipe -ggdb -march=native -ftracer -frecord-gcc-switches -fno-strict-aliasing -O2 -Wall -MT arith01.o -MD -MP -MF .deps/arith01.Tpo -c -o arith01.o /tmp/portage/sci-mathematics/reduce-20110414-r1/work/reduce-20110414/csl/cslbase/arith01.c
  906. mv -f .deps/arith01.Tpo .deps/arith01.Po
  907. gcc -DHAVE_CONFIG_H -I. -I/tmp/portage/sci-mathematics/reduce-20110414-r1/work/reduce-20110414/csl/cslbase -Dfontsdir=reduce.fonts -DBINDIR=/usr/local/bin -DPKGDATADIR=/usr/local/share/reduce -O2 -pipe -ggdb -march=native -ftracer -frecord-gcc-switches -fno-strict-aliasing -O2 -Wall -MT arith02.o -MD -MP -MF .deps/arith02.Tpo -c -o arith02.o /tmp/portage/sci-mathematics/reduce-20110414-r1/work/reduce-20110414/csl/cslbase/arith02.c
  908. mv -f .deps/arith02.Tpo .deps/arith02.Po
  909. gcc -DHAVE_CONFIG_H -I. -I/tmp/portage/sci-mathematics/reduce-20110414-r1/work/reduce-20110414/csl/cslbase -Dfontsdir=reduce.fonts -DBINDIR=/usr/local/bin -DPKGDATADIR=/usr/local/share/reduce -O2 -pipe -ggdb -march=native -ftracer -frecord-gcc-switches -fno-strict-aliasing -O2 -Wall -MT arith03.o -MD -MP -MF .deps/arith03.Tpo -c -o arith03.o /tmp/portage/sci-mathematics/reduce-20110414-r1/work/reduce-20110414/csl/cslbase/arith03.c
  910. /tmp/portage/sci-mathematics/reduce-20110414-r1/work/reduce-20110414/csl/cslbase/arith03.c: In function 'quotbn1':
  911. /tmp/portage/sci-mathematics/reduce-20110414-r1/work/reduce-20110414/csl/cslbase/arith03.c:560:22: warning: variable 'q' set but not used [-Wunused-but-set-variable]
  912. { uint32_t q, r;
  913. ^
  914. /tmp/portage/sci-mathematics/reduce-20110414-r1/work/reduce-20110414/csl/cslbase/arith03.c:571:26: warning: variable 'q0' set but not used [-Wunused-but-set-variable]
  915. { uint32_t q1, q0, r;
  916. ^
  917. /tmp/portage/sci-mathematics/reduce-20110414-r1/work/reduce-20110414/csl/cslbase/arith03.c:571:22: warning: variable 'q1' set but not used [-Wunused-but-set-variable]
  918. { uint32_t q1, q0, r;
  919. ^
  920. /tmp/portage/sci-mathematics/reduce-20110414-r1/work/reduce-20110414/csl/cslbase/arith03.c: In function 'quotbb':
  921. /tmp/portage/sci-mathematics/reduce-20110414-r1/work/reduce-20110414/csl/cslbase/arith03.c:783:4: warning: "/*" within comment [-Wcomment]
  922. /* /*
  923. ^
  924. /tmp/portage/sci-mathematics/reduce-20110414-r1/work/reduce-20110414/csl/cslbase/arith03.c:802:4: warning: "/*" within comment [-Wcomment]
  925. /* /* I do not look at carry here - I have a nasty suspicion that I should.. */
  926. ^
  927. mv -f .deps/arith03.Tpo .deps/arith03.Po
  928. gcc -DHAVE_CONFIG_H -I. -I/tmp/portage/sci-mathematics/reduce-20110414-r1/work/reduce-20110414/csl/cslbase -Dfontsdir=reduce.fonts -DBINDIR=/usr/local/bin -DPKGDATADIR=/usr/local/share/reduce -O2 -pipe -ggdb -march=native -ftracer -frecord-gcc-switches -fno-strict-aliasing -O2 -Wall -MT arith04.o -MD -MP -MF .deps/arith04.Tpo -c -o arith04.o /tmp/portage/sci-mathematics/reduce-20110414-r1/work/reduce-20110414/csl/cslbase/arith04.c
  929. /tmp/portage/sci-mathematics/reduce-20110414-r1/work/reduce-20110414/csl/cslbase/arith04.c:221:4: warning: "/*" within comment [-Wcomment]
  930. /* /* No cleaning up done, yet. Need to start to produce continued
  931. ^
  932. mv -f .deps/arith04.Tpo .deps/arith04.Po
  933. gcc -DHAVE_CONFIG_H -I. -I/tmp/portage/sci-mathematics/reduce-20110414-r1/work/reduce-20110414/csl/cslbase -Dfontsdir=reduce.fonts -DBINDIR=/usr/local/bin -DPKGDATADIR=/usr/local/share/reduce -O2 -pipe -ggdb -march=native -ftracer -frecord-gcc-switches -fno-strict-aliasing -O2 -Wall -MT arith05.o -MD -MP -MF .deps/arith05.Tpo -c -o arith05.o /tmp/portage/sci-mathematics/reduce-20110414-r1/work/reduce-20110414/csl/cslbase/arith05.c
  934. mv -f .deps/arith05.Tpo .deps/arith05.Po
  935. gcc -DHAVE_CONFIG_H -I. -I/tmp/portage/sci-mathematics/reduce-20110414-r1/work/reduce-20110414/csl/cslbase -Dfontsdir=reduce.fonts -DBINDIR=/usr/local/bin -DPKGDATADIR=/usr/local/share/reduce -O2 -pipe -ggdb -march=native -ftracer -frecord-gcc-switches -fno-strict-aliasing -O2 -Wall -MT arith06.o -MD -MP -MF .deps/arith06.Tpo -c -o arith06.o /tmp/portage/sci-mathematics/reduce-20110414-r1/work/reduce-20110414/csl/cslbase/arith06.c
  936. mv -f .deps/arith06.Tpo .deps/arith06.Po
  937. gcc -DHAVE_CONFIG_H -I. -I/tmp/portage/sci-mathematics/reduce-20110414-r1/work/reduce-20110414/csl/cslbase -Dfontsdir=reduce.fonts -DBINDIR=/usr/local/bin -DPKGDATADIR=/usr/local/share/reduce -O2 -pipe -ggdb -march=native -ftracer -frecord-gcc-switches -fno-strict-aliasing -O2 -Wall -MT arith07.o -MD -MP -MF .deps/arith07.Tpo -c -o arith07.o /tmp/portage/sci-mathematics/reduce-20110414-r1/work/reduce-20110414/csl/cslbase/arith07.c
  938. mv -f .deps/arith07.Tpo .deps/arith07.Po
  939. gcc -DHAVE_CONFIG_H -I. -I/tmp/portage/sci-mathematics/reduce-20110414-r1/work/reduce-20110414/csl/cslbase -Dfontsdir=reduce.fonts -DBINDIR=/usr/local/bin -DPKGDATADIR=/usr/local/share/reduce -O2 -pipe -ggdb -march=native -ftracer -frecord-gcc-switches -fno-strict-aliasing -O2 -Wall -MT arith08.o -MD -MP -MF .deps/arith08.Tpo -c -o arith08.o /tmp/portage/sci-mathematics/reduce-20110414-r1/work/reduce-20110414/csl/cslbase/arith08.c
  940. /tmp/portage/sci-mathematics/reduce-20110414-r1/work/reduce-20110414/csl/cslbase/arith08.c:147:4: warning: "/*" within comment [-Wcomment]
  941. /* /* Need to coerce a and b to the same type here... */
  942. ^
  943. /tmp/portage/sci-mathematics/reduce-20110414-r1/work/reduce-20110414/csl/cslbase/arith08.c:155:4: warning: "/*" within comment [-Wcomment]
  944. /* /* Need to make zero of same type as a */
  945. ^
  946. /tmp/portage/sci-mathematics/reduce-20110414-r1/work/reduce-20110414/csl/cslbase/arith08.c:271:4: warning: "/*" within comment [-Wcomment]
  947. /* /* the 0.0 returned here ought to be the same type as a has */
  948. ^
  949. /tmp/portage/sci-mathematics/reduce-20110414-r1/work/reduce-20110414/csl/cslbase/arith08.c: In function 'Lfloat_precision':
  950. /tmp/portage/sci-mathematics/reduce-20110414-r1/work/reduce-20110414/csl/cslbase/arith08.c:528:4: warning: "/*" within comment [-Wcomment]
  951. /* /* I do not cope with de-normalised numbers here */
  952. ^
  953. /tmp/portage/sci-mathematics/reduce-20110414-r1/work/reduce-20110414/csl/cslbase/arith08.c: At top level:
  954. /tmp/portage/sci-mathematics/reduce-20110414-r1/work/reduce-20110414/csl/cslbase/arith08.c:881:12: warning: "/*" within comment [-Wcomment]
  955. /* /* This case unfinished at present */
  956. ^
  957. /tmp/portage/sci-mathematics/reduce-20110414-r1/work/reduce-20110414/csl/cslbase/arith08.c:985:33: warning: "/*" within comment [-Wcomment]
  958. * versions of these functions. /*
  959. ^
  960. mv -f .deps/arith08.Tpo .deps/arith08.Po
  961. gcc -DHAVE_CONFIG_H -I. -I/tmp/portage/sci-mathematics/reduce-20110414-r1/work/reduce-20110414/csl/cslbase -Dfontsdir=reduce.fonts -DBINDIR=/usr/local/bin -DPKGDATADIR=/usr/local/share/reduce -O2 -pipe -ggdb -march=native -ftracer -frecord-gcc-switches -fno-strict-aliasing -O2 -Wall -MT arith09.o -MD -MP -MF .deps/arith09.Tpo -c -o arith09.o /tmp/portage/sci-mathematics/reduce-20110414-r1/work/reduce-20110414/csl/cslbase/arith09.c
  962. /tmp/portage/sci-mathematics/reduce-20110414-r1/work/reduce-20110414/csl/cslbase/arith09.c: In function 'huge_gcd':
  963. /tmp/portage/sci-mathematics/reduce-20110414-r1/work/reduce-20110414/csl/cslbase/arith09.c:384:22: warning: variable 'rtemp' set but not used [-Wunused-but-set-variable]
  964. { uint32_t rtemp, qtemp;
  965. ^
  966. /tmp/portage/sci-mathematics/reduce-20110414-r1/work/reduce-20110414/csl/cslbase/arith09.c: In function 'gcd':
  967. /tmp/portage/sci-mathematics/reduce-20110414-r1/work/reduce-20110414/csl/cslbase/arith09.c:666:34: warning: variable 'qtemp' set but not used [-Wunused-but-set-variable]
  968. { uint32_t qtemp;
  969. ^
  970. mv -f .deps/arith09.Tpo .deps/arith09.Po
  971. gcc -DHAVE_CONFIG_H -I. -I/tmp/portage/sci-mathematics/reduce-20110414-r1/work/reduce-20110414/csl/cslbase -Dfontsdir=reduce.fonts -DBINDIR=/usr/local/bin -DPKGDATADIR=/usr/local/share/reduce -O2 -pipe -ggdb -march=native -ftracer -frecord-gcc-switches -fno-strict-aliasing -O2 -Wall -MT arith10.o -MD -MP -MF .deps/arith10.Tpo -c -o arith10.o /tmp/portage/sci-mathematics/reduce-20110414-r1/work/reduce-20110414/csl/cslbase/arith10.c
  972. /tmp/portage/sci-mathematics/reduce-20110414-r1/work/reduce-20110414/csl/cslbase/arith10.c:228:33: warning: "/*" within comment [-Wcomment]
  973. z.real = t*(1.0-th2)/d; /* /* if th2 is very near 1.0 this is inaccurate */
  974. ^
  975. /tmp/portage/sci-mathematics/reduce-20110414-r1/work/reduce-20110414/csl/cslbase/arith10.c: In function 'iasin':
  976. /tmp/portage/sci-mathematics/reduce-20110414-r1/work/reduce-20110414/csl/cslbase/arith10.c:373:36: warning: "/*" within comment [-Wcomment]
  977. x = log(x); /* /* serious inaccuracy here */
  978. ^
  979. /tmp/portage/sci-mathematics/reduce-20110414-r1/work/reduce-20110414/csl/cslbase/arith10.c: In function 'iacos':
  980. /tmp/portage/sci-mathematics/reduce-20110414-r1/work/reduce-20110414/csl/cslbase/arith10.c:399:36: warning: "/*" within comment [-Wcomment]
  981. x = log(x); /* /* serious inaccuracy here */
  982. ^
  983. /tmp/portage/sci-mathematics/reduce-20110414-r1/work/reduce-20110414/csl/cslbase/arith10.c: At top level:
  984. /tmp/portage/sci-mathematics/reduce-20110414-r1/work/reduce-20110414/csl/cslbase/arith10.c:897:4: warning: "/*" within comment [-Wcomment]
  985. /* /* The next line can overflow or lose precision */
  986. ^
  987. /tmp/portage/sci-mathematics/reduce-20110414-r1/work/reduce-20110414/csl/cslbase/arith10.c:1716:4: warning: "/*" within comment [-Wcomment]
  988. /* /* This is not anything like good enough yet */
  989. ^
  990. /tmp/portage/sci-mathematics/reduce-20110414-r1/work/reduce-20110414/csl/cslbase/arith10.c: In function 'Labsval':
  991. /tmp/portage/sci-mathematics/reduce-20110414-r1/work/reduce-20110414/csl/cslbase/arith10.c:1753:4: warning: "/*" within comment [-Wcomment]
  992. /* /* I wonder if I am allowed to promote short or single values to
  993. ^
  994. /tmp/portage/sci-mathematics/reduce-20110414-r1/work/reduce-20110414/csl/cslbase/arith10.c: At top level:
  995. /tmp/portage/sci-mathematics/reduce-20110414-r1/work/reduce-20110414/csl/cslbase/arith10.c:1793:4: warning: "/*" within comment [-Wcomment]
  996. /* /* Wrong precision, I guess */
  997. ^
  998. mv -f .deps/arith10.Tpo .deps/arith10.Po
  999. gcc -DHAVE_CONFIG_H -I. -I/tmp/portage/sci-mathematics/reduce-20110414-r1/work/reduce-20110414/csl/cslbase -Dfontsdir=reduce.fonts -DBINDIR=/usr/local/bin -DPKGDATADIR=/usr/local/share/reduce -O2 -pipe -ggdb -march=native -ftracer -frecord-gcc-switches -fno-strict-aliasing -O2 -Wall -MT arith11.o -MD -MP -MF .deps/arith11.Tpo -c -o arith11.o /tmp/portage/sci-mathematics/reduce-20110414-r1/work/reduce-20110414/csl/cslbase/arith11.c
  1000. mv -f .deps/arith11.Tpo .deps/arith11.Po
  1001. gcc -DHAVE_CONFIG_H -I. -I/tmp/portage/sci-mathematics/reduce-20110414-r1/work/reduce-20110414/csl/cslbase -Dfontsdir=reduce.fonts -DBINDIR=/usr/local/bin -DPKGDATADIR=/usr/local/share/reduce -O2 -pipe -ggdb -march=native -ftracer -frecord-gcc-switches -fno-strict-aliasing -O2 -Wall -MT arith12.o -MD -MP -MF .deps/arith12.Tpo -c -o arith12.o /tmp/portage/sci-mathematics/reduce-20110414-r1/work/reduce-20110414/csl/cslbase/arith12.c
  1002. mv -f .deps/arith12.Tpo .deps/arith12.Po
  1003. gcc -DHAVE_CONFIG_H -I. -I/tmp/portage/sci-mathematics/reduce-20110414-r1/work/reduce-20110414/csl/cslbase -Dfontsdir=reduce.fonts -DBINDIR=/usr/local/bin -DPKGDATADIR=/usr/local/share/reduce -O2 -pipe -ggdb -march=native -ftracer -frecord-gcc-switches -fno-strict-aliasing -O2 -Wall -MT char.o -MD -MP -MF .deps/char.Tpo -c -o char.o /tmp/portage/sci-mathematics/reduce-20110414-r1/work/reduce-20110414/csl/cslbase/char.c
  1004. /tmp/portage/sci-mathematics/reduce-20110414-r1/work/reduce-20110414/csl/cslbase/char.c:185:52: warning: "/*" within comment [-Wcomment]
  1005. { if (length_of_header(h) > 4) /* @@@@ /* 4 vs CELL */
  1006. ^
  1007. /tmp/portage/sci-mathematics/reduce-20110414-r1/work/reduce-20110414/csl/cslbase/char.c:196:4: warning: "/*" within comment [-Wcomment]
  1008. * /* The issue of strings (especially non-simple ones) and the ELT function
  1009. ^
  1010. /tmp/portage/sci-mathematics/reduce-20110414-r1/work/reduce-20110414/csl/cslbase/char.c:1166:49: warning: "/*" within comment [-Wcomment]
  1011. { *high = length_of_header(h) - 4; /* @@@ /* 4 vs CELL */
  1012. ^
  1013. mv -f .deps/char.Tpo .deps/char.Po
  1014. gcc -DHAVE_CONFIG_H -I. -I/tmp/portage/sci-mathematics/reduce-20110414-r1/work/reduce-20110414/csl/cslbase -Dfontsdir=reduce.fonts -DBINDIR=/usr/local/bin -DPKGDATADIR=/usr/local/share/reduce -O2 -pipe -ggdb -march=native -ftracer -frecord-gcc-switches -fno-strict-aliasing -O2 -Wall -MT cslmpi.o -MD -MP -MF .deps/cslmpi.Tpo -c -o cslmpi.o /tmp/portage/sci-mathematics/reduce-20110414-r1/work/reduce-20110414/csl/cslbase/cslmpi.c
  1015. mv -f .deps/cslmpi.Tpo .deps/cslmpi.Po
  1016. gcc -DHAVE_CONFIG_H -I. -I/tmp/portage/sci-mathematics/reduce-20110414-r1/work/reduce-20110414/csl/cslbase -Dfontsdir=reduce.fonts -DBINDIR=/usr/local/bin -DPKGDATADIR=/usr/local/share/reduce -O2 -pipe -ggdb -march=native -ftracer -frecord-gcc-switches -fno-strict-aliasing -O2 -Wall -MT eval1.o -MD -MP -MF .deps/eval1.Tpo -c -o eval1.o /tmp/portage/sci-mathematics/reduce-20110414-r1/work/reduce-20110414/csl/cslbase/eval1.c
  1017. mv -f .deps/eval1.Tpo .deps/eval1.Po
  1018. gcc -DHAVE_CONFIG_H -I. -I/tmp/portage/sci-mathematics/reduce-20110414-r1/work/reduce-20110414/csl/cslbase -Dfontsdir=reduce.fonts -DBINDIR=/usr/local/bin -DPKGDATADIR=/usr/local/share/reduce -O2 -pipe -ggdb -march=native -ftracer -frecord-gcc-switches -fno-strict-aliasing -O2 -Wall -MT eval2.o -MD -MP -MF .deps/eval2.Tpo -c -o eval2.o /tmp/portage/sci-mathematics/reduce-20110414-r1/work/reduce-20110414/csl/cslbase/eval2.c
  1019. mv -f .deps/eval2.Tpo .deps/eval2.Po
  1020. gcc -DHAVE_CONFIG_H -I. -I/tmp/portage/sci-mathematics/reduce-20110414-r1/work/reduce-20110414/csl/cslbase -Dfontsdir=reduce.fonts -DBINDIR=/usr/local/bin -DPKGDATADIR=/usr/local/share/reduce -O2 -pipe -ggdb -march=native -ftracer -frecord-gcc-switches -fno-strict-aliasing -O2 -Wall -MT eval3.o -MD -MP -MF .deps/eval3.Tpo -c -o eval3.o /tmp/portage/sci-mathematics/reduce-20110414-r1/work/reduce-20110414/csl/cslbase/eval3.c
  1021. /tmp/portage/sci-mathematics/reduce-20110414-r1/work/reduce-20110414/csl/cslbase/eval3.c: In function 'prog_fn':
  1022. /tmp/portage/sci-mathematics/reduce-20110414-r1/work/reduce-20110414/csl/cslbase/eval3.c:334:17: warning: variable 'p' set but not used [-Wunused-but-set-variable]
  1023. Lisp_Object p, nil = C_nil;
  1024. ^
  1025. /tmp/portage/sci-mathematics/reduce-20110414-r1/work/reduce-20110414/csl/cslbase/eval3.c: In function 'Lerrorsetn':
  1026. /tmp/portage/sci-mathematics/reduce-20110414-r1/work/reduce-20110414/csl/cslbase/eval3.c:1234:17: warning: unused variable 'nil' [-Wunused-variable]
  1027. Lisp_Object nil = C_nil, form, fg1, fg2;
  1028. ^
  1029. /tmp/portage/sci-mathematics/reduce-20110414-r1/work/reduce-20110414/csl/cslbase/eval3.c: In function 'Lresource_limitn':
  1030. /tmp/portage/sci-mathematics/reduce-20110414-r1/work/reduce-20110414/csl/cslbase/eval3.c:1511:17: warning: unused variable 'nil' [-Wunused-variable]
  1031. Lisp_Object nil = C_nil, form, ltime, lspace, lio, lerrors;
  1032. ^
  1033. mv -f .deps/eval3.Tpo .deps/eval3.Po
  1034. gcc -DHAVE_CONFIG_H -I. -I/tmp/portage/sci-mathematics/reduce-20110414-r1/work/reduce-20110414/csl/cslbase -Dfontsdir=reduce.fonts -DBINDIR=/usr/local/bin -DPKGDATADIR=/usr/local/share/reduce -O2 -pipe -ggdb -march=native -ftracer -frecord-gcc-switches -fno-strict-aliasing -O2 -Wall -MT eval4.o -MD -MP -MF .deps/eval4.Tpo -c -o eval4.o /tmp/portage/sci-mathematics/reduce-20110414-r1/work/reduce-20110414/csl/cslbase/eval4.c
  1035. mv -f .deps/eval4.Tpo .deps/eval4.Po
  1036. gcc -DHAVE_CONFIG_H -I. -I/tmp/portage/sci-mathematics/reduce-20110414-r1/work/reduce-20110414/csl/cslbase -Dfontsdir=reduce.fonts -DBINDIR=/usr/local/bin -DPKGDATADIR=/usr/local/share/reduce -O2 -pipe -ggdb -march=native -ftracer -frecord-gcc-switches -fno-strict-aliasing -O2 -Wall -MT fns1.o -MD -MP -MF .deps/fns1.Tpo -c -o fns1.o /tmp/portage/sci-mathematics/reduce-20110414-r1/work/reduce-20110414/csl/cslbase/fns1.c
  1037. /tmp/portage/sci-mathematics/reduce-20110414-r1/work/reduce-20110414/csl/cslbase/fns1.c: In function 'Lrepresentation1':
  1038. /tmp/portage/sci-mathematics/reduce-20110414-r1/work/reduce-20110414/csl/cslbase/fns1.c:2055:4: warning: "/*" within comment [-Wcomment]
  1039. /* /* unreconstructed - may need to build a 64-bit int here */
  1040. ^
  1041. /tmp/portage/sci-mathematics/reduce-20110414-r1/work/reduce-20110414/csl/cslbase/fns1.c: In function 'Lrepresentation2':
  1042. /tmp/portage/sci-mathematics/reduce-20110414-r1/work/reduce-20110414/csl/cslbase/fns1.c:2083:4: warning: "/*" within comment [-Wcomment]
  1043. /* /* Unreconstructed wrt return value but trace printing is 64 bit */
  1044. ^
  1045. mv -f .deps/fns1.Tpo .deps/fns1.Po
  1046. gcc -DHAVE_CONFIG_H -I. -I/tmp/portage/sci-mathematics/reduce-20110414-r1/work/reduce-20110414/csl/cslbase -Dfontsdir=reduce.fonts -DBINDIR=/usr/local/bin -DPKGDATADIR=/usr/local/share/reduce -O2 -pipe -ggdb -march=native -ftracer -frecord-gcc-switches -fno-strict-aliasing -O2 -Wall -MT fns2.o -MD -MP -MF .deps/fns2.Tpo -c -o fns2.o /tmp/portage/sci-mathematics/reduce-20110414-r1/work/reduce-20110414/csl/cslbase/fns2.c
  1047. /tmp/portage/sci-mathematics/reduce-20110414-r1/work/reduce-20110414/csl/cslbase/fns2.c: In function 'cl_vec_equal':
  1048. /tmp/portage/sci-mathematics/reduce-20110414-r1/work/reduce-20110414/csl/cslbase/fns2.c:2278:1: warning: "/*" within comment [-Wcomment]
  1049. /* My moan here is that, as noted above, I ought to process even
  1050. ^
  1051. /tmp/portage/sci-mathematics/reduce-20110414-r1/work/reduce-20110414/csl/cslbase/fns2.c:2287:4: warning: "/*" within comment [-Wcomment]
  1052. /* /*
  1053. ^
  1054. /tmp/portage/sci-mathematics/reduce-20110414-r1/work/reduce-20110414/csl/cslbase/fns2.c:2298:4: warning: "/*" within comment [-Wcomment]
  1055. /* /*
  1056. ^
  1057. /tmp/portage/sci-mathematics/reduce-20110414-r1/work/reduce-20110414/csl/cslbase/fns2.c: In function 'equalp':
  1058. /tmp/portage/sci-mathematics/reduce-20110414-r1/work/reduce-20110414/csl/cslbase/fns2.c:2917:4: warning: "/*" within comment [-Wcomment]
  1059. /* /* At present vec_equal() is not right here */
  1060. ^
  1061. /tmp/portage/sci-mathematics/reduce-20110414-r1/work/reduce-20110414/csl/cslbase/fns2.c:2974:4: warning: "/*" within comment [-Wcomment]
  1062. /* /* wrong for Common Lisp */
  1063. ^
  1064. /tmp/portage/sci-mathematics/reduce-20110414-r1/work/reduce-20110414/csl/cslbase/fns2.c: In function 'smemq':
  1065. /tmp/portage/sci-mathematics/reduce-20110414-r1/work/reduce-20110414/csl/cslbase/fns2.c:3289:4: warning: "/*" within comment [-Wcomment]
  1066. * /* This is a bit worrying - it can use C recursion to arbitrary
  1067. ^
  1068. mv -f .deps/fns2.Tpo .deps/fns2.Po
  1069. gcc -DHAVE_CONFIG_H -I. -I/tmp/portage/sci-mathematics/reduce-20110414-r1/work/reduce-20110414/csl/cslbase -Dfontsdir=reduce.fonts -DBINDIR=/usr/local/bin -DPKGDATADIR=/usr/local/share/reduce -O2 -pipe -ggdb -march=native -ftracer -frecord-gcc-switches -fno-strict-aliasing -O2 -Wall -MT fns3.o -MD -MP -MF .deps/fns3.Tpo -c -o fns3.o /tmp/portage/sci-mathematics/reduce-20110414-r1/work/reduce-20110414/csl/cslbase/fns3.c
  1070. /tmp/portage/sci-mathematics/reduce-20110414-r1/work/reduce-20110414/csl/cslbase/fns3.c: In function 'hash_equal':
  1071. /tmp/portage/sci-mathematics/reduce-20110414-r1/work/reduce-20110414/csl/cslbase/fns3.c:776:4: warning: "/*" within comment [-Wcomment]
  1072. /* /* The code here can CRASH if asked to hash a general array that
  1073. ^
  1074. /tmp/portage/sci-mathematics/reduce-20110414-r1/work/reduce-20110414/csl/cslbase/fns3.c: In function 'hash_equalp':
  1075. /tmp/portage/sci-mathematics/reduce-20110414-r1/work/reduce-20110414/csl/cslbase/fns3.c:944:4: warning: "/*" within comment [-Wcomment]
  1076. /* /* Trouble if a general array with over 32K elements gets to here */
  1077. ^
  1078. /tmp/portage/sci-mathematics/reduce-20110414-r1/work/reduce-20110414/csl/cslbase/fns3.c: In function 'Lget_hash':
  1079. /tmp/portage/sci-mathematics/reduce-20110414-r1/work/reduce-20110414/csl/cslbase/fns3.c:1070:4: warning: "/*" within comment [-Wcomment]
  1080. /* /* The code here needs to allow for user-specified hash functions */
  1081. ^
  1082. /tmp/portage/sci-mathematics/reduce-20110414-r1/work/reduce-20110414/csl/cslbase/fns3.c:1126:4: warning: "/*" within comment [-Wcomment]
  1083. /* /* again user-specified hash functions need insertion here */
  1084. ^
  1085. mv -f .deps/fns3.Tpo .deps/fns3.Po
  1086. gcc -DHAVE_CONFIG_H -I. -I/tmp/portage/sci-mathematics/reduce-20110414-r1/work/reduce-20110414/csl/cslbase -Dfontsdir=reduce.fonts -DBINDIR=/usr/local/bin -DPKGDATADIR=/usr/local/share/reduce -O2 -pipe -ggdb -march=native -ftracer -frecord-gcc-switches -fno-strict-aliasing -O2 -Wall -MT print.o -MD -MP -MF .deps/print.Tpo -c -o print.o /tmp/portage/sci-mathematics/reduce-20110414-r1/work/reduce-20110414/csl/cslbase/print.c
  1087. /tmp/portage/sci-mathematics/reduce-20110414-r1/work/reduce-20110414/csl/cslbase/print.c: In function 'Lopen':
  1088. /tmp/portage/sci-mathematics/reduce-20110414-r1/work/reduce-20110414/csl/cslbase/print.c:1158:13: warning: variable 'pipep' set but not used [-Wunused-but-set-variable]
  1089. CSLbool pipep = NO;
  1090. ^
  1091. /tmp/portage/sci-mathematics/reduce-20110414-r1/work/reduce-20110414/csl/cslbase/print.c: In function 'internal_prin':
  1092. /tmp/portage/sci-mathematics/reduce-20110414-r1/work/reduce-20110414/csl/cslbase/print.c:1992:4: warning: "/*" within comment [-Wcomment]
  1093. * /* Width specifier not processed here (yet), sorry.
  1094. ^
  1095. /tmp/portage/sci-mathematics/reduce-20110414-r1/work/reduce-20110414/csl/cslbase/print.c:2134:42: warning: unused variable 'hexdig' [-Wunused-variable]
  1096. static char *hexdig = "0123456789abcdef";
  1097. ^
  1098. /tmp/portage/sci-mathematics/reduce-20110414-r1/work/reduce-20110414/csl/cslbase/print.c:2360:4: warning: "/*" within comment [-Wcomment]
  1099. /* /* I think that this is broken on 64-bit machines since then ielt
  1100. ^
  1101. mv -f .deps/print.Tpo .deps/print.Po
  1102. gcc -DHAVE_CONFIG_H -I. -I/tmp/portage/sci-mathematics/reduce-20110414-r1/work/reduce-20110414/csl/cslbase -Dfontsdir=reduce.fonts -DBINDIR=/usr/local/bin -DPKGDATADIR=/usr/local/share/reduce -O2 -pipe -ggdb -march=native -ftracer -frecord-gcc-switches -fno-strict-aliasing -O2 -Wall -MT cslread.o -MD -MP -MF .deps/cslread.Tpo -c -o cslread.o /tmp/portage/sci-mathematics/reduce-20110414-r1/work/reduce-20110414/csl/cslbase/cslread.c
  1103. /tmp/portage/sci-mathematics/reduce-20110414-r1/work/reduce-20110414/csl/cslbase/cslread.c: In function 'make_symbol':
  1104. /tmp/portage/sci-mathematics/reduce-20110414-r1/work/reduce-20110414/csl/cslbase/cslread.c:875:42: warning: "/*" within comment [-Wcomment]
  1105. /* qenv(w) = qenv(v); /* Copy across environment too */
  1106. ^
  1107. mv -f .deps/cslread.Tpo .deps/cslread.Po
  1108. gcc -DHAVE_CONFIG_H -I. -I/tmp/portage/sci-mathematics/reduce-20110414-r1/work/reduce-20110414/csl/cslbase -Dfontsdir=reduce.fonts -DBINDIR=/usr/local/bin -DPKGDATADIR=/usr/local/share/reduce -O2 -pipe -ggdb -march=native -ftracer -frecord-gcc-switches -fno-strict-aliasing -O2 -Wall /tmp/portage/sci-mathematics/reduce-20110414-r1/work/reduce-20110414/csl/cslbase/objtype.c -o objtype
  1109. gcc -DHAVE_CONFIG_H -I. -I/tmp/portage/sci-mathematics/reduce-20110414-r1/work/reduce-20110414/csl/cslbase -Dfontsdir=reduce.fonts -DBINDIR=/usr/local/bin -DPKGDATADIR=/usr/local/share/reduce -O2 -pipe -ggdb -march=native -ftracer -frecord-gcc-switches -fno-strict-aliasing -O2 -Wall /tmp/portage/sci-mathematics/reduce-20110414-r1/work/reduce-20110414/csl/cslbase/makeheaders.c -o makeheaders
  1110. /tmp/portage/sci-mathematics/reduce-20110414-r1/work/reduce-20110414/csl/cslbase/makeheaders.c:51:57: warning: "/*" within comment [-Wcomment]
  1111. * (I might not worry about the sequence "... \/* ...")
  1112. ^
  1113. /tmp/portage/sci-mathematics/reduce-20110414-r1/work/reduce-20110414/csl/cslbase/makeheaders.c: In function 'main':
  1114. /tmp/portage/sci-mathematics/reduce-20110414-r1/work/reduce-20110414/csl/cslbase/makeheaders.c:85:32: warning: unused variable 'instring' [-Wunused-variable]
  1115. int ch, incomment = 0, instring = 0, linestart = 1;
  1116. ^
  1117. ./objtype cslread.o \
  1118. /tmp/portage/sci-mathematics/reduce-20110414-r1/work/reduce-20110414/csl/cslbase/impex.def machineid-1.c gcc -DHAVE_CONFIG_H -I. -I/tmp/portage/sci-mathematics/reduce-20110414-r1/work/reduce-20110414/csl/cslbase -Dfontsdir=reduce.fonts -DBINDIR=/usr/local/bin -DPKGDATADIR=/usr/local/share/reduce -O2 -pipe -ggdb -march=native -ftracer -frecord-gcc-switches -shared -fPIC -fno-strict-aliasing -O2
  1119. ./makeheaders config.h /tmp/portage/sci-mathematics/reduce-20110414-r1/work/reduce-20110414/csl/cslbase/machine.h \
  1120. /tmp/portage/sci-mathematics/reduce-20110414-r1/work/reduce-20110414/csl/cslbase/tags.h \
  1121. /tmp/portage/sci-mathematics/reduce-20110414-r1/work/reduce-20110414/csl/cslbase/cslerror.h /tmp/portage/sci-mathematics/reduce-20110414-r1/work/reduce-20110414/csl/cslbase/externs.h \
  1122. /tmp/portage/sci-mathematics/reduce-20110414-r1/work/reduce-20110414/csl/cslbase/arith.h /tmp/portage/sci-mathematics/reduce-20110414-r1/work/reduce-20110414/csl/cslbase/entries.h > machineid-2.c
  1123. cat machineid-1.c machineid-2.c > machineid.c
  1124. gcc -DHAVE_CONFIG_H -I. -I/tmp/portage/sci-mathematics/reduce-20110414-r1/work/reduce-20110414/csl/cslbase -Dfontsdir=reduce.fonts -DBINDIR=/usr/local/bin -DPKGDATADIR=/usr/local/share/reduce -O2 -pipe -ggdb -march=native -ftracer -frecord-gcc-switches -fno-strict-aliasing -O2 -Wall -MT restart.o -MD -MP -MF .deps/restart.Tpo -c -o restart.o /tmp/portage/sci-mathematics/reduce-20110414-r1/work/reduce-20110414/csl/cslbase/restart.c
  1125. /tmp/portage/sci-mathematics/reduce-20110414-r1/work/reduce-20110414/csl/cslbase/restart.c: In function 'setup_dynamic':
  1126. /tmp/portage/sci-mathematics/reduce-20110414-r1/work/reduce-20110414/csl/cslbase/restart.c:4108:13: warning: variable 'all_ok' set but not used [-Wunused-but-set-variable]
  1127. int32_t all_ok = 1;
  1128. ^
  1129. /tmp/portage/sci-mathematics/reduce-20110414-r1/work/reduce-20110414/csl/cslbase/restart.c: In function 'set_up_variables':
  1130. /tmp/portage/sci-mathematics/reduce-20110414-r1/work/reduce-20110414/csl/cslbase/restart.c:5238:4: warning: "/*" within comment [-Wcomment]
  1131. /* /*
  1132. ^
  1133. mv -f .deps/restart.Tpo .deps/restart.Po
  1134. gcc -DHAVE_CONFIG_H -I. -I/tmp/portage/sci-mathematics/reduce-20110414-r1/work/reduce-20110414/csl/cslbase -Dfontsdir=reduce.fonts -DBINDIR=/usr/local/bin -DPKGDATADIR=/usr/local/share/reduce -O2 -pipe -ggdb -march=native -ftracer -frecord-gcc-switches -fno-strict-aliasing -O2 -Wall -MT sysfwin.o -MD -MP -MF .deps/sysfwin.Tpo -c -o sysfwin.o /tmp/portage/sci-mathematics/reduce-20110414-r1/work/reduce-20110414/csl/cslbase/sysfwin.c
  1135. mv -f .deps/sysfwin.Tpo .deps/sysfwin.Po
  1136. gcc -DHAVE_CONFIG_H -I. -I/tmp/portage/sci-mathematics/reduce-20110414-r1/work/reduce-20110414/csl/cslbase -Dfontsdir=reduce.fonts -DBINDIR=/usr/local/bin -DPKGDATADIR=/usr/local/share/reduce -O2 -pipe -ggdb -march=native -ftracer -frecord-gcc-switches -fno-strict-aliasing -O2 -Wall -MT csl.o -MD -MP -MF .deps/csl.Tpo -c -o csl.o /tmp/portage/sci-mathematics/reduce-20110414-r1/work/reduce-20110414/csl/cslbase/csl.c
  1137. /tmp/portage/sci-mathematics/reduce-20110414-r1/work/reduce-20110414/csl/cslbase/csl.c: In function 'PROC_set_callbacks':
  1138. /tmp/portage/sci-mathematics/reduce-20110414-r1/work/reduce-20110414/csl/cslbase/csl.c:3021:17: warning: unused variable 'nil' [-Wunused-variable]
  1139. Lisp_Object nil;
  1140. ^
  1141. /tmp/portage/sci-mathematics/reduce-20110414-r1/work/reduce-20110414/csl/cslbase/csl.c: In function 'PROC_lisp_eval':
  1142. /tmp/portage/sci-mathematics/reduce-20110414-r1/work/reduce-20110414/csl/cslbase/csl.c:3462:26: warning: unused variable 'w1' [-Wunused-variable]
  1143. Lisp_Object w = nil, w1 = nil;
  1144. ^
  1145. /tmp/portage/sci-mathematics/reduce-20110414-r1/work/reduce-20110414/csl/cslbase/csl.c: In function 'PROC_get_value':
  1146. /tmp/portage/sci-mathematics/reduce-20110414-r1/work/reduce-20110414/csl/cslbase/csl.c:3582:17: warning: unused variable 'nil' [-Wunused-variable]
  1147. Lisp_Object nil = C_nil;
  1148. ^
  1149. /tmp/portage/sci-mathematics/reduce-20110414-r1/work/reduce-20110414/csl/cslbase/csl.c: At top level:
  1150. /tmp/portage/sci-mathematics/reduce-20110414-r1/work/reduce-20110414/csl/cslbase/csl.c:70:12: warning: 'port_number' defined but not used [-Wunused-variable]
  1151. static int port_number, remote_store, current_users, max_users;
  1152. ^
  1153. /tmp/portage/sci-mathematics/reduce-20110414-r1/work/reduce-20110414/csl/cslbase/csl.c:70:25: warning: 'remote_store' defined but not used [-Wunused-variable]
  1154. static int port_number, remote_store, current_users, max_users;
  1155. ^
  1156. /tmp/portage/sci-mathematics/reduce-20110414-r1/work/reduce-20110414/csl/cslbase/csl.c:70:39: warning: 'current_users' defined but not used [-Wunused-variable]
  1157. static int port_number, remote_store, current_users, max_users;
  1158. ^
  1159. /tmp/portage/sci-mathematics/reduce-20110414-r1/work/reduce-20110414/csl/cslbase/csl.c:70:54: warning: 'max_users' defined but not used [-Wunused-variable]
  1160. static int port_number, remote_store, current_users, max_users;
  1161. ^
  1162. mv -f .deps/csl.Tpo .deps/csl.Po
  1163. gcc -DHAVE_CONFIG_H -I. -I/tmp/portage/sci-mathematics/reduce-20110414-r1/work/reduce-20110414/csl/cslbase -Dfontsdir=reduce.fonts -DBINDIR=/usr/local/bin -DPKGDATADIR=/usr/local/share/reduce -O2 -pipe -ggdb -march=native -ftracer -frecord-gcc-switches -fno-strict-aliasing -O2 -Wall -MT fasl.o -MD -MP -MF .deps/fasl.Tpo -c -o fasl.o /tmp/portage/sci-mathematics/reduce-20110414-r1/work/reduce-20110414/csl/cslbase/fasl.c
  1164. /tmp/portage/sci-mathematics/reduce-20110414-r1/work/reduce-20110414/csl/cslbase/fasl.c: In function 'load_module':
  1165. /tmp/portage/sci-mathematics/reduce-20110414-r1/work/reduce-20110414/csl/cslbase/fasl.c:1457:4: warning: "/*" within comment [-Wcomment]
  1166. /* /* BEWARE for Axiom purposes!!!!!!!! */
  1167. ^
  1168. mv -f .deps/fasl.Tpo .deps/fasl.Po
  1169. gcc -DHAVE_CONFIG_H -I. -I/tmp/portage/sci-mathematics/reduce-20110414-r1/work/reduce-20110414/csl/cslbase -Dfontsdir=reduce.fonts -DBINDIR=/usr/local/bin -DPKGDATADIR=/usr/local/share/reduce -O2 -pipe -ggdb -march=native -ftracer -frecord-gcc-switches -fno-strict-aliasing -O2 -Wall -MT gc.o -MD -MP -MF .deps/gc.Tpo -c -o gc.o /tmp/portage/sci-mathematics/reduce-20110414-r1/work/reduce-20110414/csl/cslbase/gc.c
  1170. /tmp/portage/sci-mathematics/reduce-20110414-r1/work/reduce-20110414/csl/cslbase/gc.c: In function 'reclaim':
  1171. /tmp/portage/sci-mathematics/reduce-20110414-r1/work/reduce-20110414/csl/cslbase/gc.c:2836:39: warning: "/*" within comment [-Wcomment]
  1172. /* printf("(*)"); fflush(stdout); /* while I debug! */
  1173. ^
  1174. /tmp/portage/sci-mathematics/reduce-20110414-r1/work/reduce-20110414/csl/cslbase/gc.c:2994:4: warning: "/*" within comment [-Wcomment]
  1175. /* /*
  1176. ^
  1177. /tmp/portage/sci-mathematics/reduce-20110414-r1/work/reduce-20110414/csl/cslbase/gc.c:3019:4: warning: "/*" within comment [-Wcomment]
  1178. /* /* I guess that I want garbage collection messages, if any, to
  1179. ^
  1180. mv -f .deps/gc.Tpo .deps/gc.Po
  1181. gcc -DHAVE_CONFIG_H -I. -I/tmp/portage/sci-mathematics/reduce-20110414-r1/work/reduce-20110414/csl/cslbase -Dfontsdir=reduce.fonts -DBINDIR=/usr/local/bin -DPKGDATADIR=/usr/local/share/reduce -O2 -pipe -ggdb -march=native -ftracer -frecord-gcc-switches -fno-strict-aliasing -O2 -Wall -MT preserve.o -MD -MP -MF .deps/preserve.Tpo -c -o preserve.o /tmp/portage/sci-mathematics/reduce-20110414-r1/work/reduce-20110414/csl/cslbase/preserve.c
  1182. /tmp/portage/sci-mathematics/reduce-20110414-r1/work/reduce-20110414/csl/cslbase/preserve.c: In function 'validate_checksum':
  1183. /tmp/portage/sci-mathematics/reduce-20110414-r1/work/reduce-20110414/csl/cslbase/preserve.c:1661:17: warning: unused variable 'nil' [-Wunused-variable]
  1184. Lisp_Object nil = C_nil;
  1185. ^
  1186. /tmp/portage/sci-mathematics/reduce-20110414-r1/work/reduce-20110414/csl/cslbase/preserve.c: In function 'Icopy':
  1187. /tmp/portage/sci-mathematics/reduce-20110414-r1/work/reduce-20110414/csl/cslbase/preserve.c:1756:4: warning: "/*" within comment [-Wcomment]
  1188. /* /* Not updated for native dirs yet */
  1189. ^
  1190. /tmp/portage/sci-mathematics/reduce-20110414-r1/work/reduce-20110414/csl/cslbase/preserve.c:1771:4: warning: "/*" within comment [-Wcomment]
  1191. /* /* Not updated for native dirs yet */
  1192. ^
  1193. /tmp/portage/sci-mathematics/reduce-20110414-r1/work/reduce-20110414/csl/cslbase/preserve.c: In function 'finished_with':
  1194. /tmp/portage/sci-mathematics/reduce-20110414-r1/work/reduce-20110414/csl/cslbase/preserve.c:1993:21: warning: ignoring return value of 'fread', declared with attribute warn_unused_result [-Wunused-result]
  1195. fread(b, 1, n, d->f);
  1196. ^
  1197. mv -f .deps/preserve.Tpo .deps/preserve.Po
  1198. gcc -DHAVE_CONFIG_H -I. -I/tmp/portage/sci-mathematics/reduce-20110414-r1/work/reduce-20110414/csl/cslbase -Dfontsdir=reduce.fonts -DBINDIR=/usr/local/bin -DPKGDATADIR=/usr/local/share/reduce -O2 -pipe -ggdb -march=native -ftracer -frecord-gcc-switches -fno-strict-aliasing -O2 -Wall -MT fwin.o -MD -MP -MF .deps/fwin.Tpo -c -o fwin.o /tmp/portage/sci-mathematics/reduce-20110414-r1/work/reduce-20110414/csl/cslbase/fwin.c
  1199. /tmp/portage/sci-mathematics/reduce-20110414-r1/work/reduce-20110414/csl/cslbase/fwin.c: In function 'fwin_startup':
  1200. /tmp/portage/sci-mathematics/reduce-20110414-r1/work/reduce-20110414/csl/cslbase/fwin.c:316:17: warning: unused variable 'disp' [-Wunused-variable]
  1201. const char *disp;
  1202. ^
  1203. mv -f .deps/fwin.Tpo .deps/fwin.Po
  1204. gcc -DHAVE_CONFIG_H -I. -I/tmp/portage/sci-mathematics/reduce-20110414-r1/work/reduce-20110414/csl/cslbase -Dfontsdir=reduce.fonts -DBINDIR=/usr/local/bin -DPKGDATADIR=/usr/local/share/reduce -O2 -pipe -ggdb -march=native -ftracer -frecord-gcc-switches -fno-strict-aliasing -O2 -Wall -MT termed.o -MD -MP -MF .deps/termed.Tpo -c -o termed.o /tmp/portage/sci-mathematics/reduce-20110414-r1/work/reduce-20110414/csl/cslbase/termed.c
  1205. mv -f .deps/termed.Tpo .deps/termed.Po
  1206. gcc -DHAVE_CONFIG_H -I. -I/tmp/portage/sci-mathematics/reduce-20110414-r1/work/reduce-20110414/csl/cslbase -Dfontsdir=reduce.fonts -DBINDIR=/usr/local/bin -DPKGDATADIR=/usr/local/share/reduce -O2 -pipe -ggdb -march=native -ftracer -frecord-gcc-switches -fno-strict-aliasing -O2 -Wall -MT bytes.o -MD -MP -MF .deps/bytes.Tpo -c -o bytes.o /tmp/portage/sci-mathematics/reduce-20110414-r1/work/reduce-20110414/csl/cslbase/bytes.c
  1207. In file included from /tmp/portage/sci-mathematics/reduce-20110414-r1/work/reduce-20110414/csl/cslbase/bytes.c:46:0:
  1208. /tmp/portage/sci-mathematics/reduce-20110414-r1/work/reduce-20110414/csl/cslbase/bytes1.c: In function 'bytecounts':
  1209. /tmp/portage/sci-mathematics/reduce-20110414-r1/work/reduce-20110414/csl/cslbase/bytes1.c:1001:13: warning: variable 'i' set but not used [-Wunused-but-set-variable]
  1210. int32_t i;
  1211. ^
  1212. mv -f .deps/bytes.Tpo .deps/bytes.Po
  1213. gcc -DHAVE_CONFIG_H -I. -I/tmp/portage/sci-mathematics/reduce-20110414-r1/work/reduce-20110414/csl/cslbase -Dfontsdir=reduce.fonts -DBINDIR=/usr/local/bin -DPKGDATADIR=/usr/local/share/reduce -O2 -pipe -ggdb -march=native -ftracer -frecord-gcc-switches -fno-strict-aliasing -O2 -Wall -MT stubs.o -MD -MP -MF .deps/stubs.Tpo -c -o stubs.o /tmp/portage/sci-mathematics/reduce-20110414-r1/work/reduce-20110414/csl/cslbase/stubs.c
  1214. mv -f .deps/stubs.Tpo .deps/stubs.Po
  1215. rm -rf reduce.fonts
  1216. mkdir reduce.fonts
  1217. cp /tmp/portage/sci-mathematics/reduce-20110414-r1/work/reduce-20110414/csl/cslbase/fonts/README reduce.fonts
  1218. cp /tmp/portage/sci-mathematics/reduce-20110414-r1/work/reduce-20110414/csl/cslbase/fonts/README.cmps-fonts reduce.fonts
  1219. cp /tmp/portage/sci-mathematics/reduce-20110414-r1/work/reduce-20110414/csl/cslbase/fonts/README.BaKoMa reduce.fonts
  1220. cp /tmp/portage/sci-mathematics/reduce-20110414-r1/work/reduce-20110414/csl/cslbase/fonts/*.ttf reduce.fonts
  1221. cp /tmp/portage/sci-mathematics/reduce-20110414-r1/work/reduce-20110414/csl/cslbase/fonts/*.pfb reduce.fonts
  1222. cp /tmp/portage/sci-mathematics/reduce-20110414-r1/work/reduce-20110414/csl/cslbase/fonts/*.pfa reduce.fonts
  1223. cp /tmp/portage/sci-mathematics/reduce-20110414-r1/work/reduce-20110414/csl/cslbase/fonts/fonts.dir reduce.fonts
  1224. cp /tmp/portage/sci-mathematics/reduce-20110414-r1/work/reduce-20110414/csl/cslbase/fonts/fonts.scale reduce.fonts
  1225. mkdir -p reduce.fonts/pfmfiles
  1226. cp -r /tmp/portage/sci-mathematics/reduce-20110414-r1/work/reduce-20110414/csl/cslbase/fonts/pfmfiles/*.pfm reduce.fonts/pfmfiles
  1227. mkdir -p reduce.fonts/src
  1228. cp -r /tmp/portage/sci-mathematics/reduce-20110414-r1/work/reduce-20110414/csl/cslbase/fonts/src/*.gz reduce.fonts/src
  1229. rm -f csl
  1230. g++ -O2 -pipe -ggdb -march=native -ftracer -frecord-gcc-switches -fno-strict-aliasing -O2 -Wall -Wl,-O1 -Wl,--as-needed -Wl,--hash-style=both -rdynamic -o csl arith01.o arith02.o arith03.o arith04.o arith05.o arith06.o arith07.o arith08.o arith09.o arith10.o arith11.o arith12.o char.o cslmpi.o eval1.o eval2.o eval3.o eval4.o fns1.o fns2.o fns3.o print.o cslread.o restart.o sysfwin.o csl.o fasl.o gc.o preserve.o fwin.o termed.o bytes.o stubs.o -lnsl -lpthread -lrt -ldl
  1231. print.o: In function `Ltmpnam':
  1232. /tmp/portage/sci-mathematics/reduce-20110414-r1/work/reduce-20110414/csl/cslbase/print.c:963: warning: the use of `tmpnam' is dangerous, better use `mkstemp'
  1233. termed.o: In function `term_move_right':
  1234. /tmp/portage/sci-mathematics/reduce-20110414-r1/work/reduce-20110414/csl/cslbase/termed.c:1296: undefined reference to `cur_term'
  1235. /tmp/portage/sci-mathematics/reduce-20110414-r1/work/reduce-20110414/csl/cslbase/termed.c:1296: undefined reference to `putp'
  1236. /tmp/portage/sci-mathematics/reduce-20110414-r1/work/reduce-20110414/csl/cslbase/termed.c:1300: undefined reference to `cur_term'
  1237. /tmp/portage/sci-mathematics/reduce-20110414-r1/work/reduce-20110414/csl/cslbase/termed.c:1300: undefined reference to `putp'
  1238. /tmp/portage/sci-mathematics/reduce-20110414-r1/work/reduce-20110414/csl/cslbase/termed.c:1286: undefined reference to `cur_term'
  1239. /tmp/portage/sci-mathematics/reduce-20110414-r1/work/reduce-20110414/csl/cslbase/termed.c:1286: undefined reference to `putp'
  1240. termed.o: In function `term_move_first_column':
  1241. /tmp/portage/sci-mathematics/reduce-20110414-r1/work/reduce-20110414/csl/cslbase/termed.c:1317: undefined reference to `cur_term'
  1242. /tmp/portage/sci-mathematics/reduce-20110414-r1/work/reduce-20110414/csl/cslbase/termed.c:1317: undefined reference to `putp'
  1243. termed.o: In function `term_move_down':
  1244. /tmp/portage/sci-mathematics/reduce-20110414-r1/work/reduce-20110414/csl/cslbase/termed.c:1251: undefined reference to `cur_term'
  1245. /tmp/portage/sci-mathematics/reduce-20110414-r1/work/reduce-20110414/csl/cslbase/termed.c:1251: undefined reference to `putp'
  1246. /tmp/portage/sci-mathematics/reduce-20110414-r1/work/reduce-20110414/csl/cslbase/termed.c:1255: undefined reference to `cur_term'
  1247. /tmp/portage/sci-mathematics/reduce-20110414-r1/work/reduce-20110414/csl/cslbase/termed.c:1255: undefined reference to `putp'
  1248. termed.o: In function `line_wrap':
  1249. /tmp/portage/sci-mathematics/reduce-20110414-r1/work/reduce-20110414/csl/cslbase/termed.c:1441: undefined reference to `cur_term'
  1250. /tmp/portage/sci-mathematics/reduce-20110414-r1/work/reduce-20110414/csl/cslbase/termed.c:1481: undefined reference to `cur_term'
  1251. termed.o: In function `set_normal':
  1252. /tmp/portage/sci-mathematics/reduce-20110414-r1/work/reduce-20110414/csl/cslbase/termed.c:3192: undefined reference to `cur_term'
  1253. /tmp/portage/sci-mathematics/reduce-20110414-r1/work/reduce-20110414/csl/cslbase/termed.c:3201: undefined reference to `putp'
  1254. /tmp/portage/sci-mathematics/reduce-20110414-r1/work/reduce-20110414/csl/cslbase/termed.c:3201: undefined reference to `tparm'
  1255. termed.o: In function `refresh_display':
  1256. /tmp/portage/sci-mathematics/reduce-20110414-r1/work/reduce-20110414/csl/cslbase/termed.c:1505: undefined reference to `cur_term'
  1257. termed.o: In function `measure_screen':
  1258. /tmp/portage/sci-mathematics/reduce-20110414-r1/work/reduce-20110414/csl/cslbase/termed.c:620: undefined reference to `cur_term'
  1259. /tmp/portage/sci-mathematics/reduce-20110414-r1/work/reduce-20110414/csl/cslbase/termed.c:621: undefined reference to `cur_term'
  1260. termed.o: In function `refresh_display':
  1261. /tmp/portage/sci-mathematics/reduce-20110414-r1/work/reduce-20110414/csl/cslbase/termed.c:1525: undefined reference to `cur_term'
  1262. /tmp/portage/sci-mathematics/reduce-20110414-r1/work/reduce-20110414/csl/cslbase/termed.c:1538: undefined reference to `cur_term'
  1263. termed.o:/tmp/portage/sci-mathematics/reduce-20110414-r1/work/reduce-20110414/csl/cslbase/termed.c:1546: more undefined references to `cur_term' follow
  1264. termed.o: In function `refresh_display':
  1265. /tmp/portage/sci-mathematics/reduce-20110414-r1/work/reduce-20110414/csl/cslbase/termed.c:1662: undefined reference to `putp'
  1266. /tmp/portage/sci-mathematics/reduce-20110414-r1/work/reduce-20110414/csl/cslbase/termed.c:1686: undefined reference to `cur_term'
  1267. /tmp/portage/sci-mathematics/reduce-20110414-r1/work/reduce-20110414/csl/cslbase/termed.c:1686: undefined reference to `cur_term'
  1268. /tmp/portage/sci-mathematics/reduce-20110414-r1/work/reduce-20110414/csl/cslbase/termed.c:1607: undefined reference to `cur_term'
  1269. /tmp/portage/sci-mathematics/reduce-20110414-r1/work/reduce-20110414/csl/cslbase/termed.c:1607: undefined reference to `putp'
  1270. /tmp/portage/sci-mathematics/reduce-20110414-r1/work/reduce-20110414/csl/cslbase/termed.c:1597: undefined reference to `cur_term'
  1271. /tmp/portage/sci-mathematics/reduce-20110414-r1/work/reduce-20110414/csl/cslbase/termed.c:1597: undefined reference to `putp'
  1272. termed.o: In function `term_bell':
  1273. /tmp/portage/sci-mathematics/reduce-20110414-r1/work/reduce-20110414/csl/cslbase/termed.c:1327: undefined reference to `cur_term'
  1274. termed.o: In function `set_fg':
  1275. /tmp/portage/sci-mathematics/reduce-20110414-r1/work/reduce-20110414/csl/cslbase/termed.c:3176: undefined reference to `cur_term'
  1276. /tmp/portage/sci-mathematics/reduce-20110414-r1/work/reduce-20110414/csl/cslbase/termed.c:3177: undefined reference to `tparm'
  1277. termed.o: In function `term_setup':
  1278. /tmp/portage/sci-mathematics/reduce-20110414-r1/work/reduce-20110414/csl/cslbase/termed.c:887: undefined reference to `setupterm'
  1279. /tmp/portage/sci-mathematics/reduce-20110414-r1/work/reduce-20110414/csl/cslbase/termed.c:896: undefined reference to `cur_term'
  1280. termed.o: In function `set_shell':
  1281. /tmp/portage/sci-mathematics/reduce-20110414-r1/work/reduce-20110414/csl/cslbase/termed.c:3218: undefined reference to `cur_term'
  1282. /tmp/portage/sci-mathematics/reduce-20110414-r1/work/reduce-20110414/csl/cslbase/termed.c:3227: undefined reference to `putp'
  1283. termed.o: In function `term_clear_screen':
  1284. /tmp/portage/sci-mathematics/reduce-20110414-r1/work/reduce-20110414/csl/cslbase/termed.c:2327: undefined reference to `cur_term'
  1285. /tmp/portage/sci-mathematics/reduce-20110414-r1/work/reduce-20110414/csl/cslbase/termed.c:2327: undefined reference to `putp'
  1286. termed.o: In function `set_shell':
  1287. /tmp/portage/sci-mathematics/reduce-20110414-r1/work/reduce-20110414/csl/cslbase/termed.c:3227: undefined reference to `tparm'
  1288. termed.o: In function `term_bell':
  1289. /tmp/portage/sci-mathematics/reduce-20110414-r1/work/reduce-20110414/csl/cslbase/termed.c:1327: undefined reference to `putp'
  1290. termed.o: In function `set_fg':
  1291. /tmp/portage/sci-mathematics/reduce-20110414-r1/work/reduce-20110414/csl/cslbase/termed.c:3177: undefined reference to `putp'
  1292. collect2: error: ld returned 1 exit status
  1293. Makefile:2248: recipe for target 'csl' failed
  1294. gmake[3]: *** [csl] Error 1
  1295. Makefile:695: recipe for target 'all' failed
  1296. gmake[2]: *** [all] Error 2
  1297. Makefile:464: recipe for target 'all' failed
  1298. gmake[1]: *** [all] Error 2
  1299. /tmp/portage/sci-mathematics/reduce-20110414-r1/temp/environment: line 1118: pushd: cslbuild/*/csl/reduce.doc: No such file or directory
  1300. /tmp/portage/sci-mathematics/reduce-20110414-r1/temp/environment: line 1120: popd: directory stack empty
  1301. * Compiling emacs lisp files
  1302. * Compiling GNU Emacs Elisp files ...
  1303. In toplevel form:
  1304. generic/emacs/reduce-mode.el:1098:1:Warning: global/dynamic var `start' lacks
  1305. a prefix
  1306. generic/emacs/reduce-mode.el:1119:1:Warning: global/dynamic var `pattern'
  1307. lacks a prefix
  1308. generic/emacs/reduce-mode.el:1120:1:Warning: global/dynamic var `found' lacks
  1309. a prefix
  1310. generic/emacs/reduce-mode.el:1388:1:Warning: global/dynamic var `move' lacks a
  1311. prefix
  1312. generic/emacs/reduce-mode.el:1442:1:Warning: global/dynamic var `REGEXP' lacks
  1313. a prefix
  1314. In reduce-show-delim-function:
  1315. generic/emacs/reduce-mode.el:1971:16:Warning: `forward-point' is an obsolete
  1316. function (as of 23.1); use (+ (point) N) instead.
  1317. generic/emacs/reduce-mode.el:1983:43:Warning: `forward-point' is an obsolete
  1318. function (as of 23.1); use (+ (point) N) instead.
  1319. generic/emacs/reduce-mode.el:1982:36:Warning: `forward-point' is an obsolete
  1320. function (as of 23.1); use (+ (point) N) instead.
  1321. In reduce-tagify:
  1322. generic/emacs/reduce-mode.el:2605:7:Warning: start-process-shell-command
  1323. called with 6 arguments, but accepts only 3
  1324. Wrote /tmp/portage/sci-mathematics/reduce-20110414-r1/work/reduce-20110414/generic/emacs/reduce-mode.elc
  1325. [ ok ]
  1326. >>> Source compiled.
  1327. >>> Test phase: sci-mathematics/reduce-20110414-r1
  1328. make -j24 -j1 testall
  1329. /bin/sh scripts/make.sh testall
  1330. Current machine tag is x86_64-unknown-linux-gnu
  1331. About to build in cslbuild/x86_64-unknown-linux-gnu-nogui
  1332. /usr/bin/gmake testall MYFLAGS= testall --no-print-directory
  1333. echo /usr/bin/gmake mflags=--no-print-directory myflags=testall makecmdgoals=testall
  1334. /usr/bin/gmake mflags=--no-print-directory myflags=testall makecmdgoals=testall
  1335. gcc -DHAVE_CONFIG_H -I. -I/tmp/portage/sci-mathematics/reduce-20110414-r1/work/reduce-20110414/csl/cslbase -Dfontsdir=reduce.fonts -DBINDIR=/usr/local/bin -DPKGDATADIR=/usr/local/share/reduce -O2 -pipe -ggdb -march=native -ftracer -frecord-gcc-switches -fno-strict-aliasing -O2 -Wall -MT bytes1.o -MD -MP -MF .deps/bytes1.Tpo -c -o bytes1.o /tmp/portage/sci-mathematics/reduce-20110414-r1/work/reduce-20110414/csl/cslbase/bytes1.c
  1336. mv -f .deps/bytes1.Tpo .deps/bytes1.Po
  1337. rm -rf reduce.doc
  1338. mkdir -p reduce.doc
  1339. cp -r /tmp/portage/sci-mathematics/reduce-20110414-r1/work/reduce-20110414/csl/cslbase/../reduce.doc/*.html reduce.doc
  1340. cp -r /tmp/portage/sci-mathematics/reduce-20110414-r1/work/reduce-20110414/csl/cslbase/../reduce.doc/*.tex reduce.doc
  1341. cp -r /tmp/portage/sci-mathematics/reduce-20110414-r1/work/reduce-20110414/csl/cslbase/../reduce.doc/*.gif reduce.doc
  1342. cp -r /tmp/portage/sci-mathematics/reduce-20110414-r1/work/reduce-20110414/csl/cslbase/../reduce.doc/*.txt reduce.doc
  1343. rm -f bootstrapreduce
  1344. g++ -O2 -pipe -ggdb -march=native -ftracer -frecord-gcc-switches -fno-strict-aliasing -O2 -Wall -Wl,-O1 -Wl,--as-needed -Wl,--hash-style=both -rdynamic -o bootstrapreduce arith01.o arith02.o arith03.o arith04.o arith05.o arith06.o arith07.o arith08.o arith09.o arith10.o arith11.o arith12.o char.o cslmpi.o eval1.o eval2.o eval3.o eval4.o fns1.o fns2.o fns3.o print.o cslread.o restart.o sysfwin.o csl.o fasl.o gc.o preserve.o fwin.o termed.o bytes1.o stubs.o -lnsl -lpthread -lrt -ldl
  1345. print.o: In function `Ltmpnam':
  1346. /tmp/portage/sci-mathematics/reduce-20110414-r1/work/reduce-20110414/csl/cslbase/print.c:963: warning: the use of `tmpnam' is dangerous, better use `mkstemp'
  1347. termed.o: In function `term_move_right':
  1348. /tmp/portage/sci-mathematics/reduce-20110414-r1/work/reduce-20110414/csl/cslbase/termed.c:1296: undefined reference to `cur_term'
  1349. /tmp/portage/sci-mathematics/reduce-20110414-r1/work/reduce-20110414/csl/cslbase/termed.c:1296: undefined reference to `putp'
  1350. /tmp/portage/sci-mathematics/reduce-20110414-r1/work/reduce-20110414/csl/cslbase/termed.c:1300: undefined reference to `cur_term'
  1351. /tmp/portage/sci-mathematics/reduce-20110414-r1/work/reduce-20110414/csl/cslbase/termed.c:1300: undefined reference to `putp'
  1352. /tmp/portage/sci-mathematics/reduce-20110414-r1/work/reduce-20110414/csl/cslbase/termed.c:1286: undefined reference to `cur_term'
  1353. /tmp/portage/sci-mathematics/reduce-20110414-r1/work/reduce-20110414/csl/cslbase/termed.c:1286: undefined reference to `putp'
  1354. termed.o: In function `term_move_first_column':
  1355. /tmp/portage/sci-mathematics/reduce-20110414-r1/work/reduce-20110414/csl/cslbase/termed.c:1317: undefined reference to `cur_term'
  1356. /tmp/portage/sci-mathematics/reduce-20110414-r1/work/reduce-20110414/csl/cslbase/termed.c:1317: undefined reference to `putp'
  1357. termed.o: In function `term_move_down':
  1358. /tmp/portage/sci-mathematics/reduce-20110414-r1/work/reduce-20110414/csl/cslbase/termed.c:1251: undefined reference to `cur_term'
  1359. /tmp/portage/sci-mathematics/reduce-20110414-r1/work/reduce-20110414/csl/cslbase/termed.c:1251: undefined reference to `putp'
  1360. /tmp/portage/sci-mathematics/reduce-20110414-r1/work/reduce-20110414/csl/cslbase/termed.c:1255: undefined reference to `cur_term'
  1361. /tmp/portage/sci-mathematics/reduce-20110414-r1/work/reduce-20110414/csl/cslbase/termed.c:1255: undefined reference to `putp'
  1362. termed.o: In function `line_wrap':
  1363. /tmp/portage/sci-mathematics/reduce-20110414-r1/work/reduce-20110414/csl/cslbase/termed.c:1441: undefined reference to `cur_term'
  1364. /tmp/portage/sci-mathematics/reduce-20110414-r1/work/reduce-20110414/csl/cslbase/termed.c:1481: undefined reference to `cur_term'
  1365. termed.o: In function `set_normal':
  1366. /tmp/portage/sci-mathematics/reduce-20110414-r1/work/reduce-20110414/csl/cslbase/termed.c:3192: undefined reference to `cur_term'
  1367. /tmp/portage/sci-mathematics/reduce-20110414-r1/work/reduce-20110414/csl/cslbase/termed.c:3201: undefined reference to `putp'
  1368. /tmp/portage/sci-mathematics/reduce-20110414-r1/work/reduce-20110414/csl/cslbase/termed.c:3201: undefined reference to `tparm'
  1369. termed.o: In function `refresh_display':
  1370. /tmp/portage/sci-mathematics/reduce-20110414-r1/work/reduce-20110414/csl/cslbase/termed.c:1505: undefined reference to `cur_term'
  1371. termed.o: In function `measure_screen':
  1372. /tmp/portage/sci-mathematics/reduce-20110414-r1/work/reduce-20110414/csl/cslbase/termed.c:620: undefined reference to `cur_term'
  1373. /tmp/portage/sci-mathematics/reduce-20110414-r1/work/reduce-20110414/csl/cslbase/termed.c:621: undefined reference to `cur_term'
  1374. termed.o: In function `refresh_display':
  1375. /tmp/portage/sci-mathematics/reduce-20110414-r1/work/reduce-20110414/csl/cslbase/termed.c:1525: undefined reference to `cur_term'
  1376. /tmp/portage/sci-mathematics/reduce-20110414-r1/work/reduce-20110414/csl/cslbase/termed.c:1538: undefined reference to `cur_term'
  1377. termed.o:/tmp/portage/sci-mathematics/reduce-20110414-r1/work/reduce-20110414/csl/cslbase/termed.c:1546: more undefined references to `cur_term' follow
  1378. termed.o: In function `refresh_display':
  1379. /tmp/portage/sci-mathematics/reduce-20110414-r1/work/reduce-20110414/csl/cslbase/termed.c:1662: undefined reference to `putp'
  1380. /tmp/portage/sci-mathematics/reduce-20110414-r1/work/reduce-20110414/csl/cslbase/termed.c:1686: undefined reference to `cur_term'
  1381. /tmp/portage/sci-mathematics/reduce-20110414-r1/work/reduce-20110414/csl/cslbase/termed.c:1686: undefined reference to `cur_term'
  1382. /tmp/portage/sci-mathematics/reduce-20110414-r1/work/reduce-20110414/csl/cslbase/termed.c:1607: undefined reference to `cur_term'
  1383. /tmp/portage/sci-mathematics/reduce-20110414-r1/work/reduce-20110414/csl/cslbase/termed.c:1607: undefined reference to `putp'
  1384. /tmp/portage/sci-mathematics/reduce-20110414-r1/work/reduce-20110414/csl/cslbase/termed.c:1597: undefined reference to `cur_term'
  1385. /tmp/portage/sci-mathematics/reduce-20110414-r1/work/reduce-20110414/csl/cslbase/termed.c:1597: undefined reference to `putp'
  1386. termed.o: In function `term_bell':
  1387. /tmp/portage/sci-mathematics/reduce-20110414-r1/work/reduce-20110414/csl/cslbase/termed.c:1327: undefined reference to `cur_term'
  1388. termed.o: In function `set_fg':
  1389. /tmp/portage/sci-mathematics/reduce-20110414-r1/work/reduce-20110414/csl/cslbase/termed.c:3176: undefined reference to `cur_term'
  1390. /tmp/portage/sci-mathematics/reduce-20110414-r1/work/reduce-20110414/csl/cslbase/termed.c:3177: undefined reference to `tparm'
  1391. termed.o: In function `term_setup':
  1392. /tmp/portage/sci-mathematics/reduce-20110414-r1/work/reduce-20110414/csl/cslbase/termed.c:887: undefined reference to `setupterm'
  1393. /tmp/portage/sci-mathematics/reduce-20110414-r1/work/reduce-20110414/csl/cslbase/termed.c:896: undefined reference to `cur_term'
  1394. termed.o: In function `set_shell':
  1395. /tmp/portage/sci-mathematics/reduce-20110414-r1/work/reduce-20110414/csl/cslbase/termed.c:3218: undefined reference to `cur_term'
  1396. /tmp/portage/sci-mathematics/reduce-20110414-r1/work/reduce-20110414/csl/cslbase/termed.c:3227: undefined reference to `putp'
  1397. termed.o: In function `term_clear_screen':
  1398. /tmp/portage/sci-mathematics/reduce-20110414-r1/work/reduce-20110414/csl/cslbase/termed.c:2327: undefined reference to `cur_term'
  1399. /tmp/portage/sci-mathematics/reduce-20110414-r1/work/reduce-20110414/csl/cslbase/termed.c:2327: undefined reference to `putp'
  1400. termed.o: In function `set_shell':
  1401. /tmp/portage/sci-mathematics/reduce-20110414-r1/work/reduce-20110414/csl/cslbase/termed.c:3227: undefined reference to `tparm'
  1402. termed.o: In function `term_bell':
  1403. /tmp/portage/sci-mathematics/reduce-20110414-r1/work/reduce-20110414/csl/cslbase/termed.c:1327: undefined reference to `putp'
  1404. termed.o: In function `set_fg':
  1405. /tmp/portage/sci-mathematics/reduce-20110414-r1/work/reduce-20110414/csl/cslbase/termed.c:3177: undefined reference to `putp'
  1406. collect2: error: ld returned 1 exit status
  1407. Makefile:2266: recipe for target 'bootstrapreduce' failed
  1408. gmake[2]: *** [bootstrapreduce] Error 1
  1409. Makefile:487: recipe for target 'testall' failed
  1410. gmake[1]: *** [testall] Error 2
  1411. >>> Completed testing sci-mathematics/reduce-20110414-r1
  1412. >>> Install reduce-20110414-r1 into /tmp/portage/sci-mathematics/reduce-20110414-r1/image/ category sci-mathematics
  1413. !!! doexe: reduce does not exist
  1414. !!! doexe: csl does not exist
  1415. * ERROR: sci-mathematics/reduce-20110414-r1::gentoo failed (install phase):
  1416. * doexe failed
  1417. *
  1418. * If you need support, post the output of `emerge --info '=sci-mathematics/reduce-20110414-r1::gentoo'`,
  1419. * the complete build log and the output of `emerge -pqv '=sci-mathematics/reduce-20110414-r1::gentoo'`.
  1420. * The complete build log is located at '/var/log/portage/sci-mathematics:reduce-20110414-r1:20141028-220854.log'.
  1421. * The ebuild environment file is located at '/tmp/portage/sci-mathematics/reduce-20110414-r1/temp/environment'.
  1422. * Working directory: '/tmp/portage/sci-mathematics/reduce-20110414-r1/work/reduce-20110414/cslbuild/x86_64-unknown-linux-gnu-nogui/csl'
  1423. * S: '/tmp/portage/sci-mathematics/reduce-20110414-r1/work/reduce-20110414'
  1424. * QA Notice: Automake "maintainer mode" detected:
  1425. *
  1426. * cd /tmp/portage/sci-mathematics/reduce-20110414-r1/work/reduce-20110414 && /bin/sh /tmp/portage/sci-mathematics/reduce-20110414-r1/work/reduce-20110414/missing --run aclocal-1.10
  1427. * cd /tmp/portage/sci-mathematics/reduce-20110414-r1/work/reduce-20110414 && /bin/sh /tmp/portage/sci-mathematics/reduce-20110414-r1/work/reduce-20110414/missing --run automake-1.10 --foreign
  1428. * cd /tmp/portage/sci-mathematics/reduce-20110414-r1/work/reduce-20110414 && /bin/sh /tmp/portage/sci-mathematics/reduce-20110414-r1/work/reduce-20110414/missing --run autoconf
  1429. * cd /tmp/portage/sci-mathematics/reduce-20110414-r1/work/reduce-20110414/csl/cslbase && /bin/sh /tmp/portage/sci-mathematics/reduce-20110414-r1/work/reduce-20110414/csl/cslbase/missing --run aclocal-1.10
  1430. * cd /tmp/portage/sci-mathematics/reduce-20110414-r1/work/reduce-20110414/csl/cslbase && /bin/sh /tmp/portage/sci-mathematics/reduce-20110414-r1/work/reduce-20110414/csl/cslbase/missing --run automake-1.10 --foreign
  1431. * cd /tmp/portage/sci-mathematics/reduce-20110414-r1/work/reduce-20110414/csl/cslbase && /bin/sh /tmp/portage/sci-mathematics/reduce-20110414-r1/work/reduce-20110414/csl/cslbase/missing --run autoconf
  1432. *
  1433. * If you patch Makefile.am, configure.in, or configure.ac then you
  1434. * should use autotools.eclass and eautomake or eautoreconf. Exceptions
  1435. * are limited to system packages for which it is impossible to run
  1436. * autotools during stage building. See
  1437. * http://www.gentoo.org/proj/en/qa/autofailure.xml for more information.
  1438. * QA Notice: file does not exist:
  1439. *
  1440. * doexe: reduce does not exist
  1441. * doexe: csl does not exist