1. * Package: media-radio/ax25-apps-0.0.8_rc4
  2. * Repository: gentoo
  3. * Maintainer: tomjbe@gentoo.org
  4. * USE: abi_x86_64 amd64 elibc_glibc kernel_linux userland_GNU
  5. * FEATURES: sandbox test userpriv usersandbox
  6. Installed LAPACK for library directory lib64
  7. [1] reference *
  8. Installed BLAS for library directory lib64
  9. [1] reference *
  10. Installed CBLAS for library directory lib64
  11. [1] gsl
  12. [2] reference *
  13. >>> Unpacking source...
  14. >>> Unpacking ax25-apps-0.0.8-rc4.tar.gz to /tmp/portage/media-radio/ax25-apps-0.0.8_rc4/work
  15. >>> Source unpacked in /tmp/portage/media-radio/ax25-apps-0.0.8_rc4/work
  16. >>> Preparing source in /tmp/portage/media-radio/ax25-apps-0.0.8_rc4/work/ax25-apps-0.0.8-rc4 ...
  17. >>> Source prepared.
  18. >>> Configuring source in /tmp/portage/media-radio/ax25-apps-0.0.8_rc4/work/ax25-apps-0.0.8-rc4 ...
  19. * econf: updating ax25-apps-0.0.8-rc4/config.sub with /usr/share/gnuconfig/config.sub
  20. * econf: updating ax25-apps-0.0.8-rc4/config.guess with /usr/share/gnuconfig/config.guess
  21. ./configure --prefix=/usr --build=x86_64-pc-linux-gnu --host=x86_64-pc-linux-gnu --mandir=/usr/share/man --infodir=/usr/share/info --datadir=/usr/share --sysconfdir=/etc --localstatedir=/var/lib --disable-dependency-tracking --libdir=/usr/lib64
  22. configure: loading site script /usr/share/config.site
  23. checking for a BSD-compatible install... /usr/bin/install -c
  24. checking whether build environment is sane... yes
  25. checking for a thread-safe mkdir -p... /bin/mkdir -p
  26. checking for gawk... gawk
  27. checking whether make sets $(MAKE)... yes
  28. checking for gawk... (cached) gawk
  29. checking for x86_64-pc-linux-gnu-gcc... x86_64-pc-linux-gnu-gcc
  30. checking whether the C compiler works... yes
  31. checking for C compiler default output file name... a.out
  32. checking for suffix of executables...
  33. checking whether we are cross compiling... no
  34. checking for suffix of object files... o
  35. checking whether we are using the GNU C compiler... yes
  36. checking whether x86_64-pc-linux-gnu-gcc accepts -g... yes
  37. checking for x86_64-pc-linux-gnu-gcc option to accept ISO C89... none needed
  38. checking for style of include used by make... GNU
  39. checking dependency style of x86_64-pc-linux-gnu-gcc... none
  40. checking whether ln -s works... yes
  41. checking how to run the C preprocessor... x86_64-pc-linux-gnu-gcc -E
  42. checking for grep that handles long lines and -e... /bin/grep
  43. checking for egrep... /bin/grep -E
  44. checking whether x86_64-pc-linux-gnu-gcc needs -traditional... no
  45. checking build system type... x86_64-pc-linux-gnu
  46. checking host system type... x86_64-pc-linux-gnu
  47. checking how to print strings... printf
  48. checking for a sed that does not truncate output... /bin/sed
  49. checking for fgrep... /bin/grep -F
  50. checking for ld used by x86_64-pc-linux-gnu-gcc... /usr/x86_64-pc-linux-gnu/bin/ld
  51. checking if the linker (/usr/x86_64-pc-linux-gnu/bin/ld) is GNU ld... yes
  52. checking for BSD- or MS-compatible name lister (nm)... /usr/bin/nm -B
  53. checking the name lister (/usr/bin/nm -B) interface... BSD nm
  54. checking the maximum length of command line arguments... 1572864
  55. checking whether the shell understands some XSI constructs... yes
  56. checking whether the shell understands "+="... yes
  57. checking how to convert x86_64-pc-linux-gnu file names to x86_64-pc-linux-gnu format... func_convert_file_noop
  58. checking how to convert x86_64-pc-linux-gnu file names to toolchain format... func_convert_file_noop
  59. checking for /usr/x86_64-pc-linux-gnu/bin/ld option to reload object files... -r
  60. checking for x86_64-pc-linux-gnu-objdump... x86_64-pc-linux-gnu-objdump
  61. checking how to recognize dependent libraries... pass_all
  62. checking for x86_64-pc-linux-gnu-dlltool... no
  63. checking for dlltool... no
  64. checking how to associate runtime and link libraries... printf %s\n
  65. checking for x86_64-pc-linux-gnu-ar... x86_64-pc-linux-gnu-ar
  66. checking for archiver @FILE support... @
  67. checking for x86_64-pc-linux-gnu-strip... x86_64-pc-linux-gnu-strip
  68. checking for x86_64-pc-linux-gnu-ranlib... x86_64-pc-linux-gnu-ranlib
  69. checking command to parse /usr/bin/nm -B output from x86_64-pc-linux-gnu-gcc object... ok
  70. checking for sysroot... no
  71. checking for x86_64-pc-linux-gnu-mt... no
  72. checking for mt... mt
  73. checking if mt is a manifest tool... no
  74. checking for ANSI C header files... yes
  75. checking for sys/types.h... yes
  76. checking for sys/stat.h... yes
  77. checking for stdlib.h... yes
  78. checking for string.h... yes
  79. checking for memory.h... yes
  80. checking for strings.h... yes
  81. checking for inttypes.h... yes
  82. checking for stdint.h... yes
  83. checking for unistd.h... yes
  84. checking for dlfcn.h... yes
  85. checking for objdir... .libs
  86. checking if x86_64-pc-linux-gnu-gcc supports -fno-rtti -fno-exceptions... no
  87. checking for x86_64-pc-linux-gnu-gcc option to produce PIC... -fPIC -DPIC
  88. checking if x86_64-pc-linux-gnu-gcc PIC flag -fPIC -DPIC works... yes
  89. checking if x86_64-pc-linux-gnu-gcc static flag -static works... yes
  90. checking if x86_64-pc-linux-gnu-gcc supports -c -o file.o... yes
  91. checking if x86_64-pc-linux-gnu-gcc supports -c -o file.o... (cached) yes
  92. checking whether the x86_64-pc-linux-gnu-gcc linker (/usr/x86_64-pc-linux-gnu/bin/ld -m elf_x86_64) supports shared libraries... yes
  93. checking whether -lc should be explicitly linked in... no
  94. checking dynamic linker characteristics... GNU/Linux ld.so
  95. checking how to hardcode library paths into programs... immediate
  96. checking whether stripping libraries is possible... yes
  97. checking if libtool supports shared libraries... yes
  98. checking whether to build shared libraries... yes
  99. checking whether to build static libraries... yes
  100. checking for ax25_config_load_ports in -lax25... yes
  101. checking for initscr in -lncurses... yes
  102. checking for struct ax25_fwd_struct... yes
  103. checking for struct nr_route_struct.ndigis... yes
  104. checking for struct rose_facilities_struct... yes
  105. checking for dirent.h that defines DIR... yes
  106. checking for library containing opendir... none required
  107. checking for ANSI C header files... (cached) yes
  108. checking for sys/wait.h that is POSIX.1 compatible... yes
  109. checking fcntl.h usability... yes
  110. checking fcntl.h presence... yes
  111. checking for fcntl.h... yes
  112. checking sys/file.h usability... yes
  113. checking sys/file.h presence... yes
  114. checking for sys/file.h... yes
  115. checking sys/ioctl.h usability... yes
  116. checking sys/ioctl.h presence... yes
  117. checking for sys/ioctl.h... yes
  118. checking sys/time.h usability... yes
  119. checking sys/time.h presence... yes
  120. checking for sys/time.h... yes
  121. checking syslog.h usability... yes
  122. checking syslog.h presence... yes
  123. checking for syslog.h... yes
  124. checking termio.h usability... yes
  125. checking termio.h presence... yes
  126. checking for termio.h... yes
  127. checking for unistd.h... (cached) yes
  128. checking for an ANSI C-conforming const... yes
  129. checking for inline... inline
  130. checking for off_t... yes
  131. checking whether time.h and sys/time.h may both be included... yes
  132. checking whether struct tm is in sys/time.h or time.h... time.h
  133. checking for working memcmp... yes
  134. checking return type of signal handlers... void
  135. checking for utime.h... yes
  136. checking whether utime accepts a null argument... yes
  137. checking for vprintf... yes
  138. checking for _doprnt... no
  139. checking for gettimeofday... yes
  140. checking for mktime... yes
  141. checking for select... yes
  142. checking for socket... yes
  143. checking for strdup... yes
  144. checking for strerror... yes
  145. checking for strspn... yes
  146. checking for strstr... yes
  147. checking for strtol... yes
  148. checking for strtoul... yes
  149. checking for uname... yes
  150. configure: creating ./config.status
  151. config.status: creating call/Makefile
  152. config.status: creating ax25ipd/Makefile
  153. config.status: creating listen/Makefile
  154. config.status: creating Makefile
  155. config.status: creating ax25rtd/Makefile
  156. config.status: creating ax25mond/Makefile
  157. config.status: creating ax25-apps.spec
  158. config.status: creating config.h
  159. config.status: executing depfiles commands
  160. config.status: executing libtool commands
  161. >>> Source configured.
  162. >>> Compiling source in /tmp/portage/media-radio/ax25-apps-0.0.8_rc4/work/ax25-apps-0.0.8-rc4 ...
  163. make -j24
  164. make all-recursive
  165. make[1]: Entering directory '/tmp/portage/media-radio/ax25-apps-0.0.8_rc4/work/ax25-apps-0.0.8-rc4'
  166. Making all in ax25ipd
  167. make[2]: Entering directory '/tmp/portage/media-radio/ax25-apps-0.0.8_rc4/work/ax25-apps-0.0.8-rc4/ax25ipd'
  168. x86_64-pc-linux-gnu-gcc -DHAVE_CONFIG_H -I. -I.. -DAX25_SYSCONFDIR=\""/etc/ax25"\" -DAX25_LOCALSTATEDIR=\""/var/lib/ax25"\" -DUSE_TERMIO -O2 -pipe -ggdb -march=native -ftracer -frecord-gcc-switches -Wall -c config.c
  169. x86_64-pc-linux-gnu-gcc -DHAVE_CONFIG_H -I. -I.. -DAX25_SYSCONFDIR=\""/etc/ax25"\" -DAX25_LOCALSTATEDIR=\""/var/lib/ax25"\" -DUSE_TERMIO -O2 -pipe -ggdb -march=native -ftracer -frecord-gcc-switches -Wall -c crc.c
  170. x86_64-pc-linux-gnu-gcc -DHAVE_CONFIG_H -I. -I.. -DAX25_SYSCONFDIR=\""/etc/ax25"\" -DAX25_LOCALSTATEDIR=\""/var/lib/ax25"\" -DUSE_TERMIO -O2 -pipe -ggdb -march=native -ftracer -frecord-gcc-switches -Wall -c io.c
  171. x86_64-pc-linux-gnu-gcc -DHAVE_CONFIG_H -I. -I.. -DAX25_SYSCONFDIR=\""/etc/ax25"\" -DAX25_LOCALSTATEDIR=\""/var/lib/ax25"\" -DUSE_TERMIO -O2 -pipe -ggdb -march=native -ftracer -frecord-gcc-switches -Wall -c kiss.c
  172. x86_64-pc-linux-gnu-gcc -DHAVE_CONFIG_H -I. -I.. -DAX25_SYSCONFDIR=\""/etc/ax25"\" -DAX25_LOCALSTATEDIR=\""/var/lib/ax25"\" -DUSE_TERMIO -O2 -pipe -ggdb -march=native -ftracer -frecord-gcc-switches -Wall -c ax25ipd.c
  173. x86_64-pc-linux-gnu-gcc -DHAVE_CONFIG_H -I. -I.. -DAX25_SYSCONFDIR=\""/etc/ax25"\" -DAX25_LOCALSTATEDIR=\""/var/lib/ax25"\" -DUSE_TERMIO -O2 -pipe -ggdb -march=native -ftracer -frecord-gcc-switches -Wall -c process.c
  174. x86_64-pc-linux-gnu-gcc -DHAVE_CONFIG_H -I. -I.. -DAX25_SYSCONFDIR=\""/etc/ax25"\" -DAX25_LOCALSTATEDIR=\""/var/lib/ax25"\" -DUSE_TERMIO -O2 -pipe -ggdb -march=native -ftracer -frecord-gcc-switches -Wall -c routing.c
  175. x86_64-pc-linux-gnu-gcc -DHAVE_CONFIG_H -I. -I.. -DAX25_SYSCONFDIR=\""/etc/ax25"\" -DAX25_LOCALSTATEDIR=\""/var/lib/ax25"\" -DUSE_TERMIO -O2 -pipe -ggdb -march=native -ftracer -frecord-gcc-switches -Wall -c syslog.c
  176. x86_64-pc-linux-gnu-gcc -DHAVE_CONFIG_H -I. -I.. -DAX25_SYSCONFDIR=\""/etc/ax25"\" -DAX25_LOCALSTATEDIR=\""/var/lib/ax25"\" -DUSE_TERMIO -O2 -pipe -ggdb -march=native -ftracer -frecord-gcc-switches -Wall -c bpqether.c
  177. name_ax25ipd=$(echo ax25ipd | sed -e 's,x,x,') \
  178. name_Ax25ipd=$(echo $name_ax25ipd | sed -r 's@^(.)@\U\1\E@') && \
  179. name_AX25IPD=$(echo $name_ax25ipd | sed -r 's@^(.*)@\U\1\E@') && \
  180. sed -e "s/@@@ax25ipd@@@/$name_ax25ipd/g" \
  181. -e "s/@@@Ax25ipd@@@/$name_Ax25ipd/g" \
  182. -e "s/@@@AX25IPD@@@/$name_AX25IPD/g" \
  183. ./ax25ipd.man > ax25ipd.8.tmp && \
  184. mv ax25ipd.8.tmp ax25ipd.8;
  185. name_ax25ipd=$(echo ax25ipd | sed -e 's,x,x,') \
  186. name_Ax25ipd=$(echo $name_ax25ipd | sed -r 's@^(.)@\U\1\E@') && \
  187. name_AX25IPD=$(echo $name_ax25ipd | sed -r 's@^(.*)@\U\1\E@') && \
  188. sed -e "s/@@@ax25ipd@@@/$name_ax25ipd/g" \
  189. -e "s/@@@Ax25ipd@@@/$name_Ax25ipd/g" \
  190. -e "s/@@@AX25IPD@@@/$name_AX25IPD/g" \
  191. ./ax25ipd.conf.man > ax25ipd.conf.5.tmp && \
  192. mv ax25ipd.conf.5.tmp ax25ipd.conf.5;
  193. process.c: In function 'do_beacon':
  194. process.c:235:10: warning: pointer targets in passing argument 1 of 'strcpy' differ in signedness [-Wpointer-sign]
  195. strcpy(p, bc_text); /* add the text field */
  196. ^
  197. In file included from /usr/include/features.h:366:0,
  198. from /usr/include/ctype.h:25,
  199. from ax25ipd.h:49,
  200. from process.c:15:
  201. /usr/include/bits/string3.h:102:1: note: expected 'char * __restrict__' but argument is of type 'unsigned char *'
  202. __NTH (strcpy (char *__restrict __dest, const char *__restrict __src))
  203. ^
  204. bpqether.c: In function 'send_bpq':
  205. bpqether.c:93:3: warning: ignoring return value of 'write', declared with attribute warn_unused_result [-Wunused-result]
  206. write(ttyfd, addr + offset, l + sizeof(ethertap_packet.ethernet_header) - offset);
  207. ^
  208. /bin/bash ../libtool --tag=CC --mode=link x86_64-pc-linux-gnu-gcc -DUSE_TERMIO -O2 -pipe -ggdb -march=native -ftracer -frecord-gcc-switches -Wall -Wl,-O1 -Wl,--as-needed -o ax25ipd config.o crc.o io.o kiss.o ax25ipd.o process.o routing.o syslog.o bpqether.o -lax25
  209. libtool: link: x86_64-pc-linux-gnu-gcc -DUSE_TERMIO -O2 -pipe -ggdb -march=native -ftracer -frecord-gcc-switches -Wall -Wl,-O1 -Wl,--as-needed -o ax25ipd config.o crc.o io.o kiss.o ax25ipd.o process.o routing.o syslog.o bpqether.o -lax25
  210. make[2]: Leaving directory '/tmp/portage/media-radio/ax25-apps-0.0.8_rc4/work/ax25-apps-0.0.8-rc4/ax25ipd'
  211. Making all in ax25rtd
  212. make[2]: Entering directory '/tmp/portage/media-radio/ax25-apps-0.0.8_rc4/work/ax25-apps-0.0.8-rc4/ax25rtd'
  213. x86_64-pc-linux-gnu-gcc -DHAVE_CONFIG_H -I. -I.. -DAX25_SYSCONFDIR=\""/etc/ax25"\" -DAX25_LOCALSTATEDIR=\""/var/lib/ax25"\" -O2 -pipe -ggdb -march=native -ftracer -frecord-gcc-switches -Wall -c ax25rtd.c
  214. x86_64-pc-linux-gnu-gcc -DHAVE_CONFIG_H -I. -I.. -DAX25_SYSCONFDIR=\""/etc/ax25"\" -DAX25_LOCALSTATEDIR=\""/var/lib/ax25"\" -O2 -pipe -ggdb -march=native -ftracer -frecord-gcc-switches -Wall -c cache_ctl.c
  215. x86_64-pc-linux-gnu-gcc -DHAVE_CONFIG_H -I. -I.. -DAX25_SYSCONFDIR=\""/etc/ax25"\" -DAX25_LOCALSTATEDIR=\""/var/lib/ax25"\" -O2 -pipe -ggdb -march=native -ftracer -frecord-gcc-switches -Wall -c cache_dump.c
  216. x86_64-pc-linux-gnu-gcc -DHAVE_CONFIG_H -I. -I.. -DAX25_SYSCONFDIR=\""/etc/ax25"\" -DAX25_LOCALSTATEDIR=\""/var/lib/ax25"\" -O2 -pipe -ggdb -march=native -ftracer -frecord-gcc-switches -Wall -c config.c
  217. x86_64-pc-linux-gnu-gcc -DHAVE_CONFIG_H -I. -I.. -DAX25_SYSCONFDIR=\""/etc/ax25"\" -DAX25_LOCALSTATEDIR=\""/var/lib/ax25"\" -O2 -pipe -ggdb -march=native -ftracer -frecord-gcc-switches -Wall -c listener.c
  218. x86_64-pc-linux-gnu-gcc -DHAVE_CONFIG_H -I. -I.. -DAX25_SYSCONFDIR=\""/etc/ax25"\" -DAX25_LOCALSTATEDIR=\""/var/lib/ax25"\" -O2 -pipe -ggdb -march=native -ftracer -frecord-gcc-switches -Wall -c ax25rtctl.c
  219. name_ax25rtd=$(echo ax25rtd | sed -e 's,x,x,') \
  220. name_Ax25rtd=$(echo $name_ax25rtd | sed -r 's@^(.)@\U\1\E@') && \
  221. name_AX25RTD=$(echo $name_ax25rtd | sed -r 's@^(.*)@\U\1\E@') && \
  222. name_ax25rtctl=$(echo ax25rtctl | sed -e 's,x,x,') && \
  223. name_Ax25rtctl=$(echo $name_ax25rtctl | sed -r 's@^(.)@\U\1\E@') && \
  224. name_AX25RTCTL=$(echo $name_ax25rtctl | sed -r 's@^(.*)@\U\1\E@') && \
  225. sed -e "s/@@@ax25rtd@@@/$name_ax25rtd/g" \
  226. -e "s/@@@Ax25rtd@@@/$name_Ax25rtd/g" \
  227. -e "s/@@@AX25RTD@@@/$name_AX25RTD/g" \
  228. -e "s/@@@ax25rtctl@@@/$name_ax25rtctl/g" \
  229. -e "s/@@@Ax25rtctl@@@/$name_Ax25rtctl/g" \
  230. -e "s/@@@AX25RTCTL@@@/$name_AX25RTCTL/g" \
  231. ./ax25rtd.man > ax25rtd.8.tmp && \
  232. mv ax25rtd.8.tmp ax25rtd.8;
  233. name_ax25rtd=$(echo ax25rtd | sed -e 's,x,x,') \
  234. name_Ax25rtd=$(echo $name_ax25rtd | sed -r 's@^(.)@\U\1\E@') && \
  235. name_AX25RTD=$(echo $name_ax25rtd | sed -r 's@^(.*)@\U\1\E@') && \
  236. name_ax25rtctl=$(echo ax25rtctl | sed -e 's,x,x,') && \
  237. name_Ax25rtctl=$(echo $name_ax25rtctl | sed -r 's@^(.)@\U\1\E@') && \
  238. name_AX25RTCTL=$(echo $name_ax25rtctl | sed -r 's@^(.*)@\U\1\E@') && \
  239. sed -e "s/@@@ax25rtd@@@/$name_ax25rtd/g" \
  240. -e "s/@@@Ax25rtd@@@/$name_Ax25rtd/g" \
  241. -e "s/@@@AX25RTD@@@/$name_AX25RTD/g" \
  242. -e "s/@@@ax25rtctl@@@/$name_ax25rtctl/g" \
  243. -e "s/@@@Ax25rtctl@@@/$name_Ax25rtctl/g" \
  244. -e "s/@@@AX25RTCTL@@@/$name_AX25RTCTL/g" \
  245. ./ax25rtctl.man > ax25rtctl.8.tmp && \
  246. mv ax25rtctl.8.tmp ax25rtctl.8;
  247. name_ax25rtd=$(echo ax25rtd | sed -e 's,x,x,') \
  248. name_Ax25rtd=$(echo $name_ax25rtd | sed -r 's@^(.)@\U\1\E@') && \
  249. name_AX25RTD=$(echo $name_ax25rtd | sed -r 's@^(.*)@\U\1\E@') && \
  250. name_ax25rtctl=$(echo ax25rtctl | sed -e 's,x,x,') && \
  251. name_Ax25rtctl=$(echo $name_ax25rtctl | sed -r 's@^(.)@\U\1\E@') && \
  252. name_AX25RTCTL=$(echo $name_ax25rtctl | sed -r 's@^(.*)@\U\1\E@') && \
  253. sed -e "s/@@@ax25rtd@@@/$name_ax25rtd/g" \
  254. -e "s/@@@Ax25rtd@@@/$name_Ax25rtd/g" \
  255. -e "s/@@@AX25RTD@@@/$name_AX25RTD/g" \
  256. -e "s/@@@ax25rtctl@@@/$name_ax25rtctl/g" \
  257. -e "s/@@@Ax25rtctl@@@/$name_Ax25rtctl/g" \
  258. -e "s/@@@AX25RTCTL@@@/$name_AX25RTCTL/g" \
  259. ./ax25rtd.conf.man > ax25rtd.conf.5.tmp && \
  260. mv ax25rtd.conf.5.tmp ax25rtd.conf.5;
  261. In file included from /usr/include/string.h:634:0,
  262. from cache_ctl.c:21:
  263. cache_ctl.c: In function 'update_ip_route':
  264. cache_ctl.c:53:15: warning: pointer targets in passing argument 1 of 'strlen' differ in signedness [-Wpointer-sign]
  265. if (strcmp(bp->iface, iface)) {
  266. ^
  267. In file included from cache_ctl.c:21:0:
  268. /usr/include/string.h:398:15: note: expected 'const char *' but argument is of type 'unsigned char *'
  269. extern size_t strlen (const char *__s)
  270. ^
  271. In file included from /usr/include/string.h:634:0,
  272. from cache_ctl.c:21:
  273. cache_ctl.c:53:15: warning: pointer targets in passing argument 1 of '__builtin_strcmp' differ in signedness [-Wpointer-sign]
  274. if (strcmp(bp->iface, iface)) {
  275. ^
  276. cache_ctl.c:53:15: note: expected 'const char *' but argument is of type 'unsigned char *'
  277. cache_ctl.c:53:15: warning: pointer targets in passing argument 1 of 'strlen' differ in signedness [-Wpointer-sign]
  278. if (strcmp(bp->iface, iface)) {
  279. ^
  280. In file included from cache_ctl.c:21:0:
  281. /usr/include/string.h:398:15: note: expected 'const char *' but argument is of type 'unsigned char *'
  282. extern size_t strlen (const char *__s)
  283. ^
  284. In file included from /usr/include/string.h:634:0,
  285. from cache_ctl.c:21:
  286. cache_ctl.c:53:15: warning: pointer targets in passing argument 1 of '__builtin_strcmp' differ in signedness [-Wpointer-sign]
  287. if (strcmp(bp->iface, iface)) {
  288. ^
  289. cache_ctl.c:53:15: note: expected 'const char *' but argument is of type 'unsigned char *'
  290. cache_ctl.c:53:15: warning: pointer targets in passing argument 1 of '__builtin_strcmp' differ in signedness [-Wpointer-sign]
  291. if (strcmp(bp->iface, iface)) {
  292. ^
  293. cache_ctl.c:53:15: note: expected 'const char *' but argument is of type 'unsigned char *'
  294. cache_ctl.c:53:15: warning: pointer targets in passing argument 1 of '__builtin_strcmp' differ in signedness [-Wpointer-sign]
  295. if (strcmp(bp->iface, iface)) {
  296. ^
  297. cache_ctl.c:53:15: note: expected 'const char *' but argument is of type 'unsigned char *'
  298. cache_ctl.c:55:12: warning: pointer targets in passing argument 1 of 'strcpy' differ in signedness [-Wpointer-sign]
  299. strcpy(bp->iface, iface);
  300. ^
  301. In file included from /usr/include/features.h:366:0,
  302. from /usr/include/stdlib.h:24,
  303. from cache_ctl.c:20:
  304. /usr/include/bits/string3.h:102:1: note: expected 'char * __restrict__' but argument is of type 'unsigned char *'
  305. __NTH (strcpy (char *__restrict __dest, const char *__restrict __src))
  306. ^
  307. cache_ctl.c:109:9: warning: pointer targets in passing argument 1 of 'strcpy' differ in signedness [-Wpointer-sign]
  308. strcpy(bp->iface, iface);
  309. ^
  310. In file included from /usr/include/features.h:366:0,
  311. from /usr/include/stdlib.h:24,
  312. from cache_ctl.c:20:
  313. /usr/include/bits/string3.h:102:1: note: expected 'char * __restrict__' but argument is of type 'unsigned char *'
  314. __NTH (strcpy (char *__restrict __dest, const char *__restrict __src))
  315. ^
  316. cache_ctl.c: In function 'update_ax25_route':
  317. cache_ctl.c:133:25: warning: pointer targets in initialization differ in signedness [-Wpointer-sign]
  318. unsigned char *iface = config->dev;
  319. ^
  320. In file included from /usr/include/string.h:634:0,
  321. from cache_ctl.c:21:
  322. cache_ctl.c:141:15: warning: pointer targets in passing argument 1 of 'strlen' differ in signedness [-Wpointer-sign]
  323. if (strcmp(bp->iface, iface)) {
  324. ^
  325. In file included from cache_ctl.c:21:0:
  326. /usr/include/string.h:398:15: note: expected 'const char *' but argument is of type 'unsigned char *'
  327. extern size_t strlen (const char *__s)
  328. ^
  329. In file included from /usr/include/string.h:634:0,
  330. from cache_ctl.c:21:
  331. cache_ctl.c:141:26: warning: pointer targets in passing argument 1 of 'strlen' differ in signedness [-Wpointer-sign]
  332. if (strcmp(bp->iface, iface)) {
  333. ^
  334. In file included from cache_ctl.c:21:0:
  335. /usr/include/string.h:398:15: note: expected 'const char *' but argument is of type 'unsigned char *'
  336. extern size_t strlen (const char *__s)
  337. ^
  338. In file included from /usr/include/string.h:634:0,
  339. from cache_ctl.c:21:
  340. cache_ctl.c:141:15: warning: pointer targets in passing argument 1 of '__builtin_strcmp' differ in signedness [-Wpointer-sign]
  341. if (strcmp(bp->iface, iface)) {
  342. ^
  343. cache_ctl.c:141:15: note: expected 'const char *' but argument is of type 'unsigned char *'
  344. cache_ctl.c:141:26: warning: pointer targets in passing argument 2 of '__builtin_strcmp' differ in signedness [-Wpointer-sign]
  345. if (strcmp(bp->iface, iface)) {
  346. ^
  347. cache_ctl.c:141:26: note: expected 'const char *' but argument is of type 'unsigned char *'
  348. cache_ctl.c:141:15: warning: pointer targets in passing argument 1 of 'strlen' differ in signedness [-Wpointer-sign]
  349. if (strcmp(bp->iface, iface)) {
  350. ^
  351. In file included from cache_ctl.c:21:0:
  352. /usr/include/string.h:398:15: note: expected 'const char *' but argument is of type 'unsigned char *'
  353. extern size_t strlen (const char *__s)
  354. ^
  355. In file included from /usr/include/string.h:634:0,
  356. from cache_ctl.c:21:
  357. cache_ctl.c:141:15: warning: pointer targets in passing argument 1 of '__builtin_strcmp' differ in signedness [-Wpointer-sign]
  358. if (strcmp(bp->iface, iface)) {
  359. ^
  360. cache_ctl.c:141:15: note: expected 'const char *' but argument is of type 'unsigned char *'
  361. cache_ctl.c:141:26: warning: pointer targets in passing argument 2 of '__builtin_strcmp' differ in signedness [-Wpointer-sign]
  362. if (strcmp(bp->iface, iface)) {
  363. ^
  364. cache_ctl.c:141:26: note: expected 'const char *' but argument is of type 'unsigned char *'
  365. cache_ctl.c:141:26: warning: pointer targets in passing argument 1 of 'strlen' differ in signedness [-Wpointer-sign]
  366. if (strcmp(bp->iface, iface)) {
  367. ^
  368. In file included from cache_ctl.c:21:0:
  369. /usr/include/string.h:398:15: note: expected 'const char *' but argument is of type 'unsigned char *'
  370. extern size_t strlen (const char *__s)
  371. ^
  372. In file included from /usr/include/string.h:634:0,
  373. from cache_ctl.c:21:
  374. cache_ctl.c:141:15: warning: pointer targets in passing argument 1 of '__builtin_strcmp' differ in signedness [-Wpointer-sign]
  375. if (strcmp(bp->iface, iface)) {
  376. ^
  377. cache_ctl.c:141:15: note: expected 'const char *' but argument is of type 'unsigned char *'
  378. cache_ctl.c:141:26: warning: pointer targets in passing argument 2 of '__builtin_strcmp' differ in signedness [-Wpointer-sign]
  379. if (strcmp(bp->iface, iface)) {
  380. ^
  381. cache_ctl.c:141:26: note: expected 'const char *' but argument is of type 'unsigned char *'
  382. cache_ctl.c:141:15: warning: pointer targets in passing argument 1 of '__builtin_strcmp' differ in signedness [-Wpointer-sign]
  383. if (strcmp(bp->iface, iface)) {
  384. ^
  385. cache_ctl.c:141:15: note: expected 'const char *' but argument is of type 'unsigned char *'
  386. cache_ctl.c:141:26: warning: pointer targets in passing argument 2 of '__builtin_strcmp' differ in signedness [-Wpointer-sign]
  387. if (strcmp(bp->iface, iface)) {
  388. ^
  389. cache_ctl.c:141:26: note: expected 'const char *' but argument is of type 'unsigned char *'
  390. cache_ctl.c:142:27: warning: pointer targets in passing argument 1 of 'del_kernel_ax25_route' differ in signedness [-Wpointer-sign]
  391. del_kernel_ax25_route(bp->iface,
  392. ^
  393. In file included from cache_ctl.c:28:0:
  394. ax25rtd.h:140:5: note: expected 'char *' but argument is of type 'unsigned char *'
  395. int del_kernel_ax25_route(char *dev, ax25_address *call);
  396. ^
  397. cache_ctl.c:145:12: warning: pointer targets in passing argument 1 of 'strcpy' differ in signedness [-Wpointer-sign]
  398. strcpy(bp->iface, iface);
  399. ^
  400. In file included from /usr/include/features.h:366:0,
  401. from /usr/include/stdlib.h:24,
  402. from cache_ctl.c:20:
  403. /usr/include/bits/string3.h:102:1: note: expected 'char * __restrict__' but argument is of type 'unsigned char *'
  404. __NTH (strcpy (char *__restrict __dest, const char *__restrict __src))
  405. ^
  406. cache_ctl.c:145:23: warning: pointer targets in passing argument 2 of 'strcpy' differ in signedness [-Wpointer-sign]
  407. strcpy(bp->iface, iface);
  408. ^
  409. In file included from /usr/include/features.h:366:0,
  410. from /usr/include/stdlib.h:24,
  411. from cache_ctl.c:20:
  412. /usr/include/bits/string3.h:102:1: note: expected 'const char * __restrict__' but argument is of type 'unsigned char *'
  413. __NTH (strcpy (char *__restrict __dest, const char *__restrict __src))
  414. ^
  415. cache_ctl.c:197:9: warning: pointer targets in passing argument 1 of 'strcpy' differ in signedness [-Wpointer-sign]
  416. strcpy(bp->iface, iface);
  417. ^
  418. In file included from /usr/include/features.h:366:0,
  419. from /usr/include/stdlib.h:24,
  420. from cache_ctl.c:20:
  421. /usr/include/bits/string3.h:102:1: note: expected 'char * __restrict__' but argument is of type 'unsigned char *'
  422. __NTH (strcpy (char *__restrict __dest, const char *__restrict __src))
  423. ^
  424. cache_ctl.c:197:20: warning: pointer targets in passing argument 2 of 'strcpy' differ in signedness [-Wpointer-sign]
  425. strcpy(bp->iface, iface);
  426. ^
  427. In file included from /usr/include/features.h:366:0,
  428. from /usr/include/stdlib.h:24,
  429. from cache_ctl.c:20:
  430. /usr/include/bits/string3.h:102:1: note: expected 'const char * __restrict__' but argument is of type 'unsigned char *'
  431. __NTH (strcpy (char *__restrict __dest, const char *__restrict __src))
  432. ^
  433. cache_ctl.c: In function 'remove_ip_route':
  434. cache_ctl.c:231:22: warning: pointer targets in passing argument 1 of 'del_kernel_ip_route' differ in signedness [-Wpointer-sign]
  435. del_kernel_ip_route(bp->iface, bp->ip);
  436. ^
  437. In file included from cache_ctl.c:28:0:
  438. ax25rtd.h:139:5: note: expected 'char *' but argument is of type 'unsigned char *'
  439. int del_kernel_ip_route(char *dev, long ip);
  440. ^
  441. cache_ctl.c: In function 'remove_ax25_route':
  442. cache_ctl.c:255:24: warning: pointer targets in passing argument 1 of 'del_kernel_ax25_route' differ in signedness [-Wpointer-sign]
  443. del_kernel_ax25_route(bp->iface, &bp->call);
  444. ^
  445. In file included from cache_ctl.c:28:0:
  446. ax25rtd.h:140:5: note: expected 'char *' but argument is of type 'unsigned char *'
  447. int del_kernel_ax25_route(char *dev, ax25_address *call);
  448. ^
  449. In file included from /usr/include/string.h:634:0,
  450. from cache_ctl.c:21:
  451. cache_ctl.c: In function 'del_ax25_route':
  452. cache_ctl.c:297:31: warning: pointer targets in passing argument 1 of 'strlen' differ in signedness [-Wpointer-sign]
  453. && !strcmp(config->dev, bp->iface)) {
  454. ^
  455. In file included from cache_ctl.c:21:0:
  456. /usr/include/string.h:398:15: note: expected 'const char *' but argument is of type 'unsigned char *'
  457. extern size_t strlen (const char *__s)
  458. ^
  459. In file included from /usr/include/string.h:634:0,
  460. from cache_ctl.c:21:
  461. cache_ctl.c:297:31: warning: pointer targets in passing argument 2 of '__builtin_strcmp' differ in signedness [-Wpointer-sign]
  462. && !strcmp(config->dev, bp->iface)) {
  463. ^
  464. cache_ctl.c:297:31: note: expected 'const char *' but argument is of type 'unsigned char *'
  465. cache_ctl.c:297:31: warning: pointer targets in passing argument 2 of '__builtin_strcmp' differ in signedness [-Wpointer-sign]
  466. && !strcmp(config->dev, bp->iface)) {
  467. ^
  468. cache_ctl.c:297:31: note: expected 'const char *' but argument is of type 'unsigned char *'
  469. cache_ctl.c:297:31: warning: pointer targets in passing argument 1 of 'strlen' differ in signedness [-Wpointer-sign]
  470. && !strcmp(config->dev, bp->iface)) {
  471. ^
  472. In file included from cache_ctl.c:21:0:
  473. /usr/include/string.h:398:15: note: expected 'const char *' but argument is of type 'unsigned char *'
  474. extern size_t strlen (const char *__s)
  475. ^
  476. In file included from /usr/include/string.h:634:0,
  477. from cache_ctl.c:21:
  478. cache_ctl.c:297:31: warning: pointer targets in passing argument 2 of '__builtin_strcmp' differ in signedness [-Wpointer-sign]
  479. && !strcmp(config->dev, bp->iface)) {
  480. ^
  481. cache_ctl.c:297:31: note: expected 'const char *' but argument is of type 'unsigned char *'
  482. cache_ctl.c:297:31: warning: pointer targets in passing argument 2 of '__builtin_strcmp' differ in signedness [-Wpointer-sign]
  483. && !strcmp(config->dev, bp->iface)) {
  484. ^
  485. cache_ctl.c:297:31: note: expected 'const char *' but argument is of type 'unsigned char *'
  486. ax25rtctl.c: In function 'main':
  487. ax25rtctl.c:320:18: warning: pointer targets in passing argument 1 of 'sprintf' differ in signedness [-Wpointer-sign]
  488. len = sprintf(buf, "add ax25");
  489. ^
  490. In file included from /usr/include/features.h:366:0,
  491. from /usr/include/stdio.h:27,
  492. from ax25rtctl.c:20:
  493. /usr/include/bits/stdio2.h:31:1: note: expected 'char * __restrict__' but argument is of type 'unsigned char *'
  494. __NTH (sprintf (char *__restrict __s, const char *__restrict __fmt, ...))
  495. ^
  496. ax25rtctl.c:322:20: warning: pointer targets in passing argument 1 of 'sprintf' differ in signedness [-Wpointer-sign]
  497. len += sprintf(buf + len, " %s", argv[k]);
  498. ^
  499. In file included from /usr/include/features.h:366:0,
  500. from /usr/include/stdio.h:27,
  501. from ax25rtctl.c:20:
  502. /usr/include/bits/stdio2.h:31:1: note: expected 'char * __restrict__' but argument is of type 'unsigned char *'
  503. __NTH (sprintf (char *__restrict __s, const char *__restrict __fmt, ...))
  504. ^
  505. ax25rtctl.c:323:12: warning: pointer targets in passing argument 1 of 'sprintf' differ in signedness [-Wpointer-sign]
  506. sprintf(buf + len, "\n");
  507. ^
  508. In file included from /usr/include/features.h:366:0,
  509. from /usr/include/stdio.h:27,
  510. from ax25rtctl.c:20:
  511. /usr/include/bits/stdio2.h:31:1: note: expected 'char * __restrict__' but argument is of type 'unsigned char *'
  512. __NTH (sprintf (char *__restrict __s, const char *__restrict __fmt, ...))
  513. ^
  514. ax25rtctl.c:326:16: warning: pointer targets in passing argument 2 of 'wsock' differ in signedness [-Wpointer-sign]
  515. wsock(sock, buf);
  516. ^
  517. ax25rtctl.c:95:12: note: expected 'char *' but argument is of type 'unsigned char *'
  518. static int wsock(int sock, char *s)
  519. ^
  520. ax25rtctl.c:332:18: warning: pointer targets in passing argument 1 of 'sprintf' differ in signedness [-Wpointer-sign]
  521. len = sprintf(buf, "add ip");
  522. ^
  523. In file included from /usr/include/features.h:366:0,
  524. from /usr/include/stdio.h:27,
  525. from ax25rtctl.c:20:
  526. /usr/include/bits/stdio2.h:31:1: note: expected 'char * __restrict__' but argument is of type 'unsigned char *'
  527. __NTH (sprintf (char *__restrict __s, const char *__restrict __fmt, ...))
  528. ^
  529. ax25rtctl.c:334:20: warning: pointer targets in passing argument 1 of 'sprintf' differ in signedness [-Wpointer-sign]
  530. len += sprintf(buf + len, " %s", argv[k]);
  531. ^
  532. In file included from /usr/include/features.h:366:0,
  533. from /usr/include/stdio.h:27,
  534. from ax25rtctl.c:20:
  535. /usr/include/bits/stdio2.h:31:1: note: expected 'char * __restrict__' but argument is of type 'unsigned char *'
  536. __NTH (sprintf (char *__restrict __s, const char *__restrict __fmt, ...))
  537. ^
  538. ax25rtctl.c:335:12: warning: pointer targets in passing argument 1 of 'sprintf' differ in signedness [-Wpointer-sign]
  539. sprintf(buf + len, "\n");
  540. ^
  541. In file included from /usr/include/features.h:366:0,
  542. from /usr/include/stdio.h:27,
  543. from ax25rtctl.c:20:
  544. /usr/include/bits/stdio2.h:31:1: note: expected 'char * __restrict__' but argument is of type 'unsigned char *'
  545. __NTH (sprintf (char *__restrict __s, const char *__restrict __fmt, ...))
  546. ^
  547. ax25rtctl.c:338:16: warning: pointer targets in passing argument 2 of 'wsock' differ in signedness [-Wpointer-sign]
  548. wsock(sock, buf);
  549. ^
  550. ax25rtctl.c:95:12: note: expected 'char *' but argument is of type 'unsigned char *'
  551. static int wsock(int sock, char *s)
  552. ^
  553. ax25rtctl.c:348:12: warning: pointer targets in passing argument 1 of 'sprintf' differ in signedness [-Wpointer-sign]
  554. sprintf(buf, "del ax25 %s %s\n", argv[optind],
  555. ^
  556. In file included from /usr/include/features.h:366:0,
  557. from /usr/include/stdio.h:27,
  558. from ax25rtctl.c:20:
  559. /usr/include/bits/stdio2.h:31:1: note: expected 'char * __restrict__' but argument is of type 'unsigned char *'
  560. __NTH (sprintf (char *__restrict __s, const char *__restrict __fmt, ...))
  561. ^
  562. ax25rtctl.c:352:16: warning: pointer targets in passing argument 2 of 'wsock' differ in signedness [-Wpointer-sign]
  563. wsock(sock, buf);
  564. ^
  565. ax25rtctl.c:95:12: note: expected 'char *' but argument is of type 'unsigned char *'
  566. static int wsock(int sock, char *s)
  567. ^
  568. ax25rtctl.c:358:12: warning: pointer targets in passing argument 1 of 'sprintf' differ in signedness [-Wpointer-sign]
  569. sprintf(buf, "del ip %s\n", argv[optind]);
  570. ^
  571. In file included from /usr/include/features.h:366:0,
  572. from /usr/include/stdio.h:27,
  573. from ax25rtctl.c:20:
  574. /usr/include/bits/stdio2.h:31:1: note: expected 'char * __restrict__' but argument is of type 'unsigned char *'
  575. __NTH (sprintf (char *__restrict __s, const char *__restrict __fmt, ...))
  576. ^
  577. ax25rtctl.c:361:16: warning: pointer targets in passing argument 2 of 'wsock' differ in signedness [-Wpointer-sign]
  578. wsock(sock, buf);
  579. ^
  580. ax25rtctl.c:95:12: note: expected 'char *' but argument is of type 'unsigned char *'
  581. static int wsock(int sock, char *s)
  582. ^
  583. ax25rtctl.c:379:11: warning: pointer targets in passing argument 1 of 'sprintf' differ in signedness [-Wpointer-sign]
  584. sprintf(buf, "expire %ld\n", when);
  585. ^
  586. In file included from /usr/include/features.h:366:0,
  587. from /usr/include/stdio.h:27,
  588. from ax25rtctl.c:20:
  589. /usr/include/bits/stdio2.h:31:1: note: expected 'char * __restrict__' but argument is of type 'unsigned char *'
  590. __NTH (sprintf (char *__restrict __s, const char *__restrict __fmt, ...))
  591. ^
  592. ax25rtctl.c:380:15: warning: pointer targets in passing argument 2 of 'wsock' differ in signedness [-Wpointer-sign]
  593. wsock(sock, buf);
  594. ^
  595. ax25rtctl.c:95:12: note: expected 'char *' but argument is of type 'unsigned char *'
  596. static int wsock(int sock, char *s)
  597. ^
  598. ax25rtctl.c: In function 'Version':
  599. ax25rtctl.c:256:2: warning: ignoring return value of 'read', declared with attribute warn_unused_result [-Wunused-result]
  600. read(sock, buf, sizeof(buf));
  601. ^
  602. ax25rtctl.c: In function 'debug':
  603. ax25rtctl.c:301:5: warning: ignoring return value of 'write', declared with attribute warn_unused_result [-Wunused-result]
  604. write(0, buf, n);
  605. ^
  606. cache_dump.c: In function 'dump_ip_routes':
  607. cache_dump.c:48:8: warning: pointer targets in assignment differ in signedness [-Wpointer-sign]
  608. dev = bp->iface;
  609. ^
  610. cache_dump.c:51:28: warning: pointer targets in passing argument 1 of 'dev_get_config' differ in signedness [-Wpointer-sign]
  611. config = dev_get_config(bp->iface);
  612. ^
  613. In file included from cache_dump.c:33:0:
  614. ax25rtd.h:147:10: note: expected 'char *' but argument is of type 'unsigned char *'
  615. config * dev_get_config(char *dev);
  616. ^
  617. cache_dump.c:55:9: warning: pointer targets in assignment differ in signedness [-Wpointer-sign]
  618. dev = bp->iface;
  619. ^
  620. cache_dump.c: In function 'dump_ax25_routes':
  621. cache_dump.c:92:8: warning: pointer targets in assignment differ in signedness [-Wpointer-sign]
  622. dev = bp->iface;
  623. ^
  624. cache_dump.c:95:28: warning: pointer targets in passing argument 1 of 'dev_get_config' differ in signedness [-Wpointer-sign]
  625. config = dev_get_config(bp->iface);
  626. ^
  627. In file included from cache_dump.c:33:0:
  628. ax25rtd.h:147:10: note: expected 'char *' but argument is of type 'unsigned char *'
  629. config * dev_get_config(char *dev);
  630. ^
  631. cache_dump.c:99:9: warning: pointer targets in assignment differ in signedness [-Wpointer-sign]
  632. dev = bp->iface;
  633. ^
  634. listener.c: In function 'set_route':
  635. listener.c:209:2: warning: ignoring return value of 'fgets', declared with attribute warn_unused_result [-Wunused-result]
  636. fgets(buf, sizeof(buf) - 1, fp); /* discard header */
  637. ^
  638. cache_dump.c: In function 'dump_ip_routes':
  639. cache_dump.c:74:3: warning: ignoring return value of 'write', declared with attribute warn_unused_result [-Wunused-result]
  640. write(fd, buf, len);
  641. ^
  642. cache_dump.c:78:3: warning: ignoring return value of 'write', declared with attribute warn_unused_result [-Wunused-result]
  643. write(fd, ".\n", 2);
  644. ^
  645. cache_dump.c: In function 'dump_ax25_routes':
  646. cache_dump.c:111:3: warning: ignoring return value of 'write', declared with attribute warn_unused_result [-Wunused-result]
  647. write(fd, buf, len);
  648. ^
  649. cache_dump.c:115:3: warning: ignoring return value of 'write', declared with attribute warn_unused_result [-Wunused-result]
  650. write(fd, ".\n", 2);
  651. ^
  652. config.c: In function 'interpret_command':
  653. config.c:554:22: warning: pointer targets in passing argument 1 of 'prepare_cmdline' differ in signedness [-Wpointer-sign]
  654. p = prepare_cmdline(buf);
  655. ^
  656. config.c:68:7: note: expected 'char *' but argument is of type 'unsigned char *'
  657. char *prepare_cmdline(char *buf)
  658. ^
  659. config.c: In function 'load_cache':
  660. config.c:687:25: warning: pointer targets in passing argument 2 of 'interpret_command' differ in signedness [-Wpointer-sign]
  661. interpret_command(2, buf);
  662. ^
  663. config.c:544:6: note: expected 'unsigned char *' but argument is of type 'char *'
  664. void interpret_command(int fd, unsigned char *buf)
  665. ^
  666. config.c:695:25: warning: pointer targets in passing argument 2 of 'interpret_command' differ in signedness [-Wpointer-sign]
  667. interpret_command(2, buf);
  668. ^
  669. config.c:544:6: note: expected 'unsigned char *' but argument is of type 'char *'
  670. void interpret_command(int fd, unsigned char *buf)
  671. ^
  672. config.c: In function 'interpret_command':
  673. config.c:673:3: warning: ignoring return value of 'write', declared with attribute warn_unused_result [-Wunused-result]
  674. write(fd, buf, strlen(buf));
  675. ^
  676. /bin/bash ../libtool --tag=CC --mode=link x86_64-pc-linux-gnu-gcc -O2 -pipe -ggdb -march=native -ftracer -frecord-gcc-switches -Wall -Wl,-O1 -Wl,--as-needed -o ax25rtctl ax25rtctl.o -lax25
  677. libtool: link: x86_64-pc-linux-gnu-gcc -O2 -pipe -ggdb -march=native -ftracer -frecord-gcc-switches -Wall -Wl,-O1 -Wl,--as-needed -o ax25rtctl ax25rtctl.o -lax25
  678. /bin/bash ../libtool --tag=CC --mode=link x86_64-pc-linux-gnu-gcc -O2 -pipe -ggdb -march=native -ftracer -frecord-gcc-switches -Wall -Wl,-O1 -Wl,--as-needed -o ax25rtd ax25rtd.o cache_ctl.o cache_dump.o config.o listener.o -lax25
  679. libtool: link: x86_64-pc-linux-gnu-gcc -O2 -pipe -ggdb -march=native -ftracer -frecord-gcc-switches -Wall -Wl,-O1 -Wl,--as-needed -o ax25rtd ax25rtd.o cache_ctl.o cache_dump.o config.o listener.o -lax25
  680. make[2]: Leaving directory '/tmp/portage/media-radio/ax25-apps-0.0.8_rc4/work/ax25-apps-0.0.8-rc4/ax25rtd'
  681. Making all in call
  682. make[2]: Entering directory '/tmp/portage/media-radio/ax25-apps-0.0.8_rc4/work/ax25-apps-0.0.8-rc4/call'
  683. x86_64-pc-linux-gnu-gcc -DHAVE_CONFIG_H -I. -I.. -O2 -pipe -ggdb -march=native -ftracer -frecord-gcc-switches -Wall -c call.c
  684. x86_64-pc-linux-gnu-gcc -DHAVE_CONFIG_H -I. -I.. -O2 -pipe -ggdb -march=native -ftracer -frecord-gcc-switches -Wall -c menu.c
  685. x86_64-pc-linux-gnu-gcc -DHAVE_CONFIG_H -I. -I.. -O2 -pipe -ggdb -march=native -ftracer -frecord-gcc-switches -Wall -c crc.c
  686. x86_64-pc-linux-gnu-gcc -DHAVE_CONFIG_H -I. -I.. -O2 -pipe -ggdb -march=native -ftracer -frecord-gcc-switches -Wall -c yapp.c
  687. x86_64-pc-linux-gnu-gcc -DHAVE_CONFIG_H -I. -I.. -O2 -pipe -ggdb -march=native -ftracer -frecord-gcc-switches -Wall -c dostime.c
  688. name_call=$(echo call | sed -e 's,x,x,') \
  689. name_Call=$(echo $name_call | sed -r 's@^(.)@\U\1\E@') && \
  690. name_CALL=$(echo $name_call | sed -r 's@^(.*)@\U\1\E@') && \
  691. name_listen=$(echo listen | sed -e 's,x,x,') \
  692. name_Listen=$(echo $name_listen | sed -r 's@^(.)@\U\1\E@') && \
  693. name_LISTEN=$(echo $name_listen | sed -r 's@^(.*)@\U\1\E@') &&\
  694. sed -e "s/@@@call@@@/$name_call/g" \
  695. -e "s/@@@Call@@@/$name_Call/g" \
  696. -e "s/@@@CALL@@@/$name_CALL/g" \
  697. -e "s/@@@listen@@@/$name_listen/g" \
  698. -e "s/@@@Listen@@@/$name_Listen/g" \
  699. -e "s/@@@LISTEN@@@/$name_LISTEN/g" \
  700. ./call.man > call.1.tmp && \
  701. mv call.1.tmp call.1;
  702. yapp.c: In function 'yapp_download_data':
  703. yapp.c:294:9: warning: pointer targets in assignment differ in signedness [-Wpointer-sign]
  704. hptr = buffer + 2;
  705. ^
  706. yapp.c: In function 'yapp_upload_data':
  707. yapp.c:552:16: warning: pointer targets in passing argument 1 of 'atol' differ in signedness [-Wpointer-sign]
  708. rpos = atol(buffer + 4);
  709. ^
  710. In file included from /usr/include/features.h:366:0,
  711. from /usr/include/sys/types.h:25,
  712. from yapp.c:22:
  713. /usr/include/stdlib.h:283:1: note: expected 'const char *' but argument is of type 'unsigned char *'
  714. __NTH (atol (const char *__nptr))
  715. ^
  716. yapp.c: In function 'Send_SI':
  717. yapp.c:173:2: warning: ignoring return value of 'write', declared with attribute warn_unused_result [-Wunused-result]
  718. write(fd, buffer, 2);
  719. ^
  720. yapp.c: In function 'Send_CN':
  721. yapp.c:188:2: warning: ignoring return value of 'write', declared with attribute warn_unused_result [-Wunused-result]
  722. write(fd, buffer, length + 2);
  723. ^
  724. yapp.c: In function 'Send_DT':
  725. yapp.c:241:2: warning: ignoring return value of 'write', declared with attribute warn_unused_result [-Wunused-result]
  726. write(fd, buffer, 2);
  727. ^
  728. yapp.c: In function 'Send_EF':
  729. yapp.c:251:2: warning: ignoring return value of 'write', declared with attribute warn_unused_result [-Wunused-result]
  730. write(fd, buffer, 2);
  731. ^
  732. yapp.c: In function 'Send_HD':
  733. yapp.c:218:2: warning: ignoring return value of 'write', declared with attribute warn_unused_result [-Wunused-result]
  734. write(fd, buffer, len + 2);
  735. ^
  736. yapp.c: In function 'Send_ET':
  737. yapp.c:228:2: warning: ignoring return value of 'write', declared with attribute warn_unused_result [-Wunused-result]
  738. write(fd, buffer, 2);
  739. ^
  740. yapp.c: In function 'Send_NR':
  741. yapp.c:143:2: warning: ignoring return value of 'write', declared with attribute warn_unused_result [-Wunused-result]
  742. write(fd, buffer, length + 2);
  743. ^
  744. yapp.c: In function 'yapp_download_data':
  745. yapp.c:379:4: warning: ignoring return value of 'write', declared with attribute warn_unused_result [-Wunused-result]
  746. write(*filefd, buffer + 2, length);
  747. ^
  748. yapp.c: In function 'Send_RR':
  749. yapp.c:88:2: warning: ignoring return value of 'write', declared with attribute warn_unused_result [-Wunused-result]
  750. write(fd, buffer, 2);
  751. ^
  752. yapp.c: In function 'Send_RS':
  753. yapp.c:163:2: warning: ignoring return value of 'write', declared with attribute warn_unused_result [-Wunused-result]
  754. write(fd, buffer, len + 2);
  755. ^
  756. yapp.c: In function 'Send_RT':
  757. yapp.c:108:2: warning: ignoring return value of 'write', declared with attribute warn_unused_result [-Wunused-result]
  758. write(fd, buffer, 2);
  759. ^
  760. yapp.c: In function 'Send_RF':
  761. yapp.c:98:2: warning: ignoring return value of 'write', declared with attribute warn_unused_result [-Wunused-result]
  762. write(fd, buffer, 2);
  763. ^
  764. yapp.c: In function 'Send_AT':
  765. yapp.c:128:2: warning: ignoring return value of 'write', declared with attribute warn_unused_result [-Wunused-result]
  766. write(fd, buffer, 2);
  767. ^
  768. yapp.c: In function 'Send_AF':
  769. yapp.c:118:2: warning: ignoring return value of 'write', declared with attribute warn_unused_result [-Wunused-result]
  770. write(fd, buffer, 2);
  771. ^
  772. call.c: In function 'writemsg':
  773. call.c:1284:4: warning: ignoring return value of 'write', declared with attribute warn_unused_result [-Wunused-result]
  774. write(fd, text_row, strlen(text_row));
  775. ^
  776. call.c: In function 'remotecommand':
  777. call.c:1306:4: warning: ignoring return value of 'write', declared with attribute warn_unused_result [-Wunused-result]
  778. write(fd, buf + firstchar, bytes - firstchar + 1);
  779. ^
  780. call.c:1310:3: warning: ignoring return value of 'write', declared with attribute warn_unused_result [-Wunused-result]
  781. write(fd, "Unknown command\r", 16);
  782. ^
  783. call.c: In function 'sevenplname':
  784. call.c:1506:3: warning: ignoring return value of 'write', declared with attribute warn_unused_result [-Wunused-result]
  785. write(*logfile, s, strlen(s));
  786. ^
  787. call.c:1509:2: warning: ignoring return value of 'write', declared with attribute warn_unused_result [-Wunused-result]
  788. write(*f, key_words[2], strlen(key_words[2]));
  789. ^
  790. call.c:1511:2: warning: ignoring return value of 'write', declared with attribute warn_unused_result [-Wunused-result]
  791. write(*f, parms, parmsbytes);
  792. ^
  793. call.c: In function 'cmd_call':
  794. call.c:1783:7: warning: ignoring return value of 'write', declared with attribute warn_unused_result [-Wunused-result]
  795. write(downloadfile,
  796. ^
  797. call.c:1789:7: warning: ignoring return value of 'write', declared with attribute warn_unused_result [-Wunused-result]
  798. write(downloadfile, parms,
  799. ^
  800. call.c:1876:6: warning: ignoring return value of 'system', declared with attribute warn_unused_result [-Wunused-result]
  801. system(c);
  802. ^
  803. call.c: In function 'nr_convert_call':
  804. call.c:190:2: warning: ignoring return value of 'fgets', declared with attribute warn_unused_result [-Wunused-result]
  805. fgets(buffer, 100, fp);
  806. ^
  807. /bin/bash ../libtool --tag=CC --mode=link x86_64-pc-linux-gnu-gcc -O2 -pipe -ggdb -march=native -ftracer -frecord-gcc-switches -Wall -Wl,-O1 -Wl,--as-needed -o call call.o menu.o crc.o yapp.o dostime.o -lncurses -lax25
  808. libtool: link: x86_64-pc-linux-gnu-gcc -O2 -pipe -ggdb -march=native -ftracer -frecord-gcc-switches -Wall -Wl,-O1 -Wl,--as-needed -o call call.o menu.o crc.o yapp.o dostime.o -lncurses -lax25
  809. /usr/lib/gcc/x86_64-pc-linux-gnu/4.9.2/../../../../x86_64-pc-linux-gnu/bin/ld: call.o: undefined reference to symbol 'acs_map'
  810. /lib64/libtinfo.so.5: error adding symbols: DSO missing from command line
  811. collect2: error: ld returned 1 exit status
  812. Makefile:338: recipe for target 'call' failed
  813. make[2]: *** [call] Error 1
  814. make[2]: Leaving directory '/tmp/portage/media-radio/ax25-apps-0.0.8_rc4/work/ax25-apps-0.0.8-rc4/call'
  815. Makefile:327: recipe for target 'all-recursive' failed
  816. make[1]: *** [all-recursive] Error 1
  817. make[1]: Leaving directory '/tmp/portage/media-radio/ax25-apps-0.0.8_rc4/work/ax25-apps-0.0.8-rc4'
  818. Makefile:256: recipe for target 'all' failed
  819. make: *** [all] Error 2
  820. * ERROR: media-radio/ax25-apps-0.0.8_rc4::gentoo failed (compile phase):
  821. * emake failed
  822. *
  823. * If you need support, post the output of `emerge --info '=media-radio/ax25-apps-0.0.8_rc4::gentoo'`,
  824. * the complete build log and the output of `emerge -pqv '=media-radio/ax25-apps-0.0.8_rc4::gentoo'`.
  825. * The complete build log is located at '/var/log/portage/media-radio:ax25-apps-0.0.8_rc4:20141111-170323.log'.
  826. * The ebuild environment file is located at '/tmp/portage/media-radio/ax25-apps-0.0.8_rc4/temp/environment'.
  827. * Working directory: '/tmp/portage/media-radio/ax25-apps-0.0.8_rc4/work/ax25-apps-0.0.8-rc4'
  828. * S: '/tmp/portage/media-radio/ax25-apps-0.0.8_rc4/work/ax25-apps-0.0.8-rc4'