1. * Package: games-puzzle/meandmyshadow-0.3
  2. * Repository: gentoo
  3. * Maintainer: games@gentoo.org
  4. * USE: amd64 elibc_glibc kernel_linux multilib test userland_GNU
  5. * FEATURES: sandbox test userpriv usersandbox
  6. >>> Unpacking source...
  7. >>> Unpacking meandmyshadow-0.3-src.tar.gz to /tmp/portage/games-puzzle/meandmyshadow-0.3/work
  8. >>> Source unpacked in /tmp/portage/games-puzzle/meandmyshadow-0.3/work
  9. >>> Preparing source in /tmp/portage/games-puzzle/meandmyshadow-0.3/work/meandmyshadow-0.3 ...
  10. * Applying meandmyshadow-0.3-cmake.patch ...
  11. [ ok ]
  12. >>> Source prepared.
  13. >>> Configuring source in /tmp/portage/games-puzzle/meandmyshadow-0.3/work/meandmyshadow-0.3 ...
  14. >>> Working in BUILD_DIR: "/tmp/portage/games-puzzle/meandmyshadow-0.3/work/meandmyshadow-0.3_build"
  15. cmake --no-warn-unused-cli -C /tmp/portage/games-puzzle/meandmyshadow-0.3/work/meandmyshadow-0.3_build/gentoo_common_config.cmake -DCMAKE_INSTALL_PREFIX=/usr -DCMAKE_VERBOSE_MAKEFILE=TRUE -DCMAKE_INSTALL_PREFIX=/usr/games -DBINDIR=/usr/games/bin -DDATAROOTDIR=/usr/share/games -DICONDIR=/usr/share/icons -DDESKTOPDIR=/usr/share/applications -DCMAKE_BUILD_TYPE=Gentoo -DCMAKE_INSTALL_DO_STRIP=OFF -DCMAKE_USER_MAKE_RULES_OVERRIDE=/tmp/portage/games-puzzle/meandmyshadow-0.3/work/meandmyshadow-0.3_build/gentoo_rules.cmake /tmp/portage/games-puzzle/meandmyshadow-0.3/work/meandmyshadow-0.3
  16. Not searching for unused variables given on the command line.
  17. loading initial cache file /tmp/portage/games-puzzle/meandmyshadow-0.3/work/meandmyshadow-0.3_build/gentoo_common_config.cmake
  18. Re-run cmake no build system arguments
  19. -- The C compiler identification is GNU 4.7.1
  20. -- The CXX compiler identification is GNU 4.7.1
  21. -- Check for working C compiler: /usr/bin/x86_64-pc-linux-gnu-gcc
  22. -- Check for working C compiler: /usr/bin/x86_64-pc-linux-gnu-gcc -- works
  23. -- Detecting C compiler ABI info
  24. -- Detecting C compiler ABI info - done
  25. -- Check for working CXX compiler: /usr/bin/x86_64-pc-linux-gnu-g++
  26. -- Check for working CXX compiler: /usr/bin/x86_64-pc-linux-gnu-g++ -- works
  27. -- Detecting CXX compiler ABI info
  28. -- Detecting CXX compiler ABI info - done
  29. -- Looking for include file pthread.h
  30. -- Looking for include file pthread.h - found
  31. -- Looking for pthread_create
  32. -- Looking for pthread_create - not found.
  33. -- Looking for pthread_create in pthreads
  34. -- Looking for pthread_create in pthreads - not found
  35. -- Looking for pthread_create in pthread
  36. -- Looking for pthread_create in pthread - found
  37. -- Found Threads: TRUE
  38. -- Found SDL: /usr/lib64/libSDLmain.a;/usr/lib64/libSDL.so;-lpthread
  39. -- Found SDLTTF: /usr/lib64/libSDL_ttf.so
  40. -- Found SDLIMAGE: /usr/lib64/libSDL_image.so
  41. -- Found SDLMIXER: /usr/lib64/libSDL_mixer.so
  42. -- Found CURL: /usr/lib64/libcurl.so (found version "7.26.0")
  43. -- Found LibArchive: /usr/lib64/libarchive.so
  44. -- Found OpenSSL: /usr/lib64/libssl.so;/usr/lib64/libcrypto.so (found version "1.0.1c")
  45. -- <<< Gentoo configuration >>>
  46. Build type Gentoo
  47. Install path /usr/games
  48. Compiler flags:
  49. C -O2 -pipe -ggdb -march=native -ftracer
  50. C++ -O2 -pipe -ggdb -march=native -ftracer
  51. Linker flags:
  52. Executable -Wl,-O1 -Wl,--as-needed
  53. Module -Wl,-O1 -Wl,--as-needed
  54. Shared -Wl,-O1 -Wl,--as-needed
  55. -- Configuring done
  56. -- Generating done
  57. -- Build files have been written to: /tmp/portage/games-puzzle/meandmyshadow-0.3/work/meandmyshadow-0.3_build
  58. >>> Source configured.
  59. >>> Compiling source in /tmp/portage/games-puzzle/meandmyshadow-0.3/work/meandmyshadow-0.3 ...
  60. >>> Working in BUILD_DIR: "/tmp/portage/games-puzzle/meandmyshadow-0.3/work/meandmyshadow-0.3_build"
  61. make -j24 VERBOSE=1
  62. /usr/bin/cmake -H/tmp/portage/games-puzzle/meandmyshadow-0.3/work/meandmyshadow-0.3 -B/tmp/portage/games-puzzle/meandmyshadow-0.3/work/meandmyshadow-0.3_build --check-build-system CMakeFiles/Makefile.cmake 0
  63. /usr/bin/cmake -E cmake_progress_start /tmp/portage/games-puzzle/meandmyshadow-0.3/work/meandmyshadow-0.3_build/CMakeFiles /tmp/portage/games-puzzle/meandmyshadow-0.3/work/meandmyshadow-0.3_build/CMakeFiles/progress.marks
  64. make -f CMakeFiles/Makefile2 all
  65. make[1]: Entering directory `/tmp/portage/games-puzzle/meandmyshadow-0.3/work/meandmyshadow-0.3_build'
  66. make -f CMakeFiles/meandmyshadow.dir/build.make CMakeFiles/meandmyshadow.dir/depend
  67. make[2]: Entering directory `/tmp/portage/games-puzzle/meandmyshadow-0.3/work/meandmyshadow-0.3_build'
  68. cd /tmp/portage/games-puzzle/meandmyshadow-0.3/work/meandmyshadow-0.3_build && /usr/bin/cmake -E cmake_depends "Unix Makefiles" /tmp/portage/games-puzzle/meandmyshadow-0.3/work/meandmyshadow-0.3 /tmp/portage/games-puzzle/meandmyshadow-0.3/work/meandmyshadow-0.3 /tmp/portage/games-puzzle/meandmyshadow-0.3/work/meandmyshadow-0.3_build /tmp/portage/games-puzzle/meandmyshadow-0.3/work/meandmyshadow-0.3_build /tmp/portage/games-puzzle/meandmyshadow-0.3/work/meandmyshadow-0.3_build/CMakeFiles/meandmyshadow.dir/DependInfo.cmake
  69. Dependee "/tmp/portage/games-puzzle/meandmyshadow-0.3/work/meandmyshadow-0.3_build/CMakeFiles/meandmyshadow.dir/DependInfo.cmake" is newer than depender "/tmp/portage/games-puzzle/meandmyshadow-0.3/work/meandmyshadow-0.3_build/CMakeFiles/meandmyshadow.dir/depend.internal".
  70. Dependee "/tmp/portage/games-puzzle/meandmyshadow-0.3/work/meandmyshadow-0.3_build/CMakeFiles/CMakeDirectoryInformation.cmake" is newer than depender "/tmp/portage/games-puzzle/meandmyshadow-0.3/work/meandmyshadow-0.3_build/CMakeFiles/meandmyshadow.dir/depend.internal".
  71. Scanning dependencies of target meandmyshadow
  72. make[2]: Leaving directory `/tmp/portage/games-puzzle/meandmyshadow-0.3/work/meandmyshadow-0.3_build'
  73. make -f CMakeFiles/meandmyshadow.dir/build.make CMakeFiles/meandmyshadow.dir/build
  74. make[2]: Entering directory `/tmp/portage/games-puzzle/meandmyshadow-0.3/work/meandmyshadow-0.3_build'
  75. /usr/bin/cmake -E cmake_progress_report /tmp/portage/games-puzzle/meandmyshadow-0.3/work/meandmyshadow-0.3_build/CMakeFiles 1
  76. /usr/bin/cmake -E cmake_progress_report /tmp/portage/games-puzzle/meandmyshadow-0.3/work/meandmyshadow-0.3_build/CMakeFiles 2
  77. /usr/bin/cmake -E cmake_progress_report /tmp/portage/games-puzzle/meandmyshadow-0.3/work/meandmyshadow-0.3_build/CMakeFiles 3
  78. /usr/bin/cmake -E cmake_progress_report /tmp/portage/games-puzzle/meandmyshadow-0.3/work/meandmyshadow-0.3_build/CMakeFiles 4
  79. /usr/bin/cmake -E cmake_progress_report /tmp/portage/games-puzzle/meandmyshadow-0.3/work/meandmyshadow-0.3_build/CMakeFiles 5
  80. /usr/bin/cmake -E cmake_progress_report /tmp/portage/games-puzzle/meandmyshadow-0.3/work/meandmyshadow-0.3_build/CMakeFiles 6
  81. /usr/bin/cmake -E cmake_progress_report /tmp/portage/games-puzzle/meandmyshadow-0.3/work/meandmyshadow-0.3_build/CMakeFiles 7
  82. /usr/bin/cmake -E cmake_progress_report /tmp/portage/games-puzzle/meandmyshadow-0.3/work/meandmyshadow-0.3_build/CMakeFiles 8
  83. /usr/bin/cmake -E cmake_progress_report /tmp/portage/games-puzzle/meandmyshadow-0.3/work/meandmyshadow-0.3_build/CMakeFiles 9
  84. /usr/bin/cmake -E cmake_progress_report /tmp/portage/games-puzzle/meandmyshadow-0.3/work/meandmyshadow-0.3_build/CMakeFiles 10
  85. /usr/bin/cmake -E cmake_progress_report /tmp/portage/games-puzzle/meandmyshadow-0.3/work/meandmyshadow-0.3_build/CMakeFiles 11
  86. [ 3%] /usr/bin/cmake -E cmake_progress_report /tmp/portage/games-puzzle/meandmyshadow-0.3/work/meandmyshadow-0.3_build/CMakeFiles 12
  87. [ 6%] /usr/bin/cmake -E cmake_progress_report /tmp/portage/games-puzzle/meandmyshadow-0.3/work/meandmyshadow-0.3_build/CMakeFiles 13
  88. [ 10%] /usr/bin/cmake -E cmake_progress_report /tmp/portage/games-puzzle/meandmyshadow-0.3/work/meandmyshadow-0.3_build/CMakeFiles 14
  89. [ 13%] /usr/bin/cmake -E cmake_progress_report /tmp/portage/games-puzzle/meandmyshadow-0.3/work/meandmyshadow-0.3_build/CMakeFiles 15
  90. [ 20%] [ 20%] [ 23%] /usr/bin/cmake -E cmake_progress_report /tmp/portage/games-puzzle/meandmyshadow-0.3/work/meandmyshadow-0.3_build/CMakeFiles 16
  91. [ 26%] [ 30%] Building CXX object CMakeFiles/meandmyshadow.dir/src/Functions.cpp.o
  92. [ 36%] /usr/bin/cmake -E cmake_progress_report /tmp/portage/games-puzzle/meandmyshadow-0.3/work/meandmyshadow-0.3_build/CMakeFiles 17
  93. [ 36%] [ 40%] Building CXX object CMakeFiles/meandmyshadow.dir/src/Objects.cpp.o
  94. Building CXX object CMakeFiles/meandmyshadow.dir/src/TitleMenu.cpp.o
  95. /usr/bin/x86_64-pc-linux-gnu-g++ -DNDEBUG -O2 -pipe -ggdb -march=native -ftracer -I/usr/include/SDL -I/tmp/portage/games-puzzle/meandmyshadow-0.3/work/meandmyshadow-0.3_build -o CMakeFiles/meandmyshadow.dir/src/Functions.cpp.o -c /tmp/portage/games-puzzle/meandmyshadow-0.3/work/meandmyshadow-0.3/src/Functions.cpp
  96. [ 43%] [ 46%] /usr/bin/x86_64-pc-linux-gnu-g++ -DNDEBUG -O2 -pipe -ggdb -march=native -ftracer -I/usr/include/SDL -I/tmp/portage/games-puzzle/meandmyshadow-0.3/work/meandmyshadow-0.3_build -o CMakeFiles/meandmyshadow.dir/src/Objects.cpp.o -c /tmp/portage/games-puzzle/meandmyshadow-0.3/work/meandmyshadow-0.3/src/Objects.cpp
  97. Building CXX object CMakeFiles/meandmyshadow.dir/src/GUITextArea.cpp.o
  98. /usr/bin/x86_64-pc-linux-gnu-g++ -DNDEBUG -O2 -pipe -ggdb -march=native -ftracer -I/usr/include/SDL -I/tmp/portage/games-puzzle/meandmyshadow-0.3/work/meandmyshadow-0.3_build -o CMakeFiles/meandmyshadow.dir/src/TitleMenu.cpp.o -c /tmp/portage/games-puzzle/meandmyshadow-0.3/work/meandmyshadow-0.3/src/TitleMenu.cpp
  99. Building CXX object CMakeFiles/meandmyshadow.dir/src/Settings.cpp.o
  100. Building CXX object CMakeFiles/meandmyshadow.dir/src/MusicManager.cpp.o
  101. /usr/bin/x86_64-pc-linux-gnu-g++ -DNDEBUG -O2 -pipe -ggdb -march=native -ftracer -I/usr/include/SDL -I/tmp/portage/games-puzzle/meandmyshadow-0.3/work/meandmyshadow-0.3_build -o CMakeFiles/meandmyshadow.dir/src/GUITextArea.cpp.o -c /tmp/portage/games-puzzle/meandmyshadow-0.3/work/meandmyshadow-0.3/src/GUITextArea.cpp
  102. Building CXX object CMakeFiles/meandmyshadow.dir/src/Game.cpp.o
  103. /usr/bin/x86_64-pc-linux-gnu-g++ -DNDEBUG -O2 -pipe -ggdb -march=native -ftracer -I/usr/include/SDL -I/tmp/portage/games-puzzle/meandmyshadow-0.3/work/meandmyshadow-0.3_build -o CMakeFiles/meandmyshadow.dir/src/Settings.cpp.o -c /tmp/portage/games-puzzle/meandmyshadow-0.3/work/meandmyshadow-0.3/src/Settings.cpp
  104. [ 50%] /usr/bin/x86_64-pc-linux-gnu-g++ -DNDEBUG -O2 -pipe -ggdb -march=native -ftracer -I/usr/include/SDL -I/tmp/portage/games-puzzle/meandmyshadow-0.3/work/meandmyshadow-0.3_build -o CMakeFiles/meandmyshadow.dir/src/MusicManager.cpp.o -c /tmp/portage/games-puzzle/meandmyshadow-0.3/work/meandmyshadow-0.3/src/MusicManager.cpp
  105. [ 53%] /usr/bin/x86_64-pc-linux-gnu-g++ -DNDEBUG -O2 -pipe -ggdb -march=native -ftracer -I/usr/include/SDL -I/tmp/portage/games-puzzle/meandmyshadow-0.3/work/meandmyshadow-0.3_build -o CMakeFiles/meandmyshadow.dir/src/Game.cpp.o -c /tmp/portage/games-puzzle/meandmyshadow-0.3/work/meandmyshadow-0.3/src/Game.cpp
  106. Building CXX object CMakeFiles/meandmyshadow.dir/src/GameObjects.cpp.o
  107. Building CXX object CMakeFiles/meandmyshadow.dir/src/Addons.cpp.o
  108. Building CXX object CMakeFiles/meandmyshadow.dir/src/LevelPlaySelect.cpp.o
  109. Building CXX object CMakeFiles/meandmyshadow.dir/src/GUIScrollBar.cpp.o
  110. /usr/bin/x86_64-pc-linux-gnu-g++ -DNDEBUG -O2 -pipe -ggdb -march=native -ftracer -I/usr/include/SDL -I/tmp/portage/games-puzzle/meandmyshadow-0.3/work/meandmyshadow-0.3_build -o CMakeFiles/meandmyshadow.dir/src/Addons.cpp.o -c /tmp/portage/games-puzzle/meandmyshadow-0.3/work/meandmyshadow-0.3/src/Addons.cpp
  111. Building CXX object CMakeFiles/meandmyshadow.dir/src/GUIObject.cpp.o
  112. /usr/bin/x86_64-pc-linux-gnu-g++ -DNDEBUG -O2 -pipe -ggdb -march=native -ftracer -I/usr/include/SDL -I/tmp/portage/games-puzzle/meandmyshadow-0.3/work/meandmyshadow-0.3_build -o CMakeFiles/meandmyshadow.dir/src/LevelPlaySelect.cpp.o -c /tmp/portage/games-puzzle/meandmyshadow-0.3/work/meandmyshadow-0.3/src/LevelPlaySelect.cpp
  113. /usr/bin/x86_64-pc-linux-gnu-g++ -DNDEBUG -O2 -pipe -ggdb -march=native -ftracer -I/usr/include/SDL -I/tmp/portage/games-puzzle/meandmyshadow-0.3/work/meandmyshadow-0.3_build -o CMakeFiles/meandmyshadow.dir/src/GameObjects.cpp.o -c /tmp/portage/games-puzzle/meandmyshadow-0.3/work/meandmyshadow-0.3/src/GameObjects.cpp
  114. [ 56%] /usr/bin/x86_64-pc-linux-gnu-g++ -DNDEBUG -O2 -pipe -ggdb -march=native -ftracer -I/usr/include/SDL -I/tmp/portage/games-puzzle/meandmyshadow-0.3/work/meandmyshadow-0.3_build -o CMakeFiles/meandmyshadow.dir/src/GUIScrollBar.cpp.o -c /tmp/portage/games-puzzle/meandmyshadow-0.3/work/meandmyshadow-0.3/src/GUIScrollBar.cpp
  115. /usr/bin/x86_64-pc-linux-gnu-g++ -DNDEBUG -O2 -pipe -ggdb -march=native -ftracer -I/usr/include/SDL -I/tmp/portage/games-puzzle/meandmyshadow-0.3/work/meandmyshadow-0.3_build -o CMakeFiles/meandmyshadow.dir/src/GUIObject.cpp.o -c /tmp/portage/games-puzzle/meandmyshadow-0.3/work/meandmyshadow-0.3/src/GUIObject.cpp
  116. Building CXX object CMakeFiles/meandmyshadow.dir/src/Timer.cpp.o
  117. Building CXX object CMakeFiles/meandmyshadow.dir/src/FileManager.cpp.o
  118. /usr/bin/cmake -E cmake_progress_report /tmp/portage/games-puzzle/meandmyshadow-0.3/work/meandmyshadow-0.3_build/CMakeFiles 18
  119. /usr/bin/x86_64-pc-linux-gnu-g++ -DNDEBUG -O2 -pipe -ggdb -march=native -ftracer -I/usr/include/SDL -I/tmp/portage/games-puzzle/meandmyshadow-0.3/work/meandmyshadow-0.3_build -o CMakeFiles/meandmyshadow.dir/src/Timer.cpp.o -c /tmp/portage/games-puzzle/meandmyshadow-0.3/work/meandmyshadow-0.3/src/Timer.cpp
  120. Building CXX object CMakeFiles/meandmyshadow.dir/src/LevelEditSelect.cpp.o
  121. /usr/bin/x86_64-pc-linux-gnu-g++ -DNDEBUG -O2 -pipe -ggdb -march=native -ftracer -I/usr/include/SDL -I/tmp/portage/games-puzzle/meandmyshadow-0.3/work/meandmyshadow-0.3_build -o CMakeFiles/meandmyshadow.dir/src/FileManager.cpp.o -c /tmp/portage/games-puzzle/meandmyshadow-0.3/work/meandmyshadow-0.3/src/FileManager.cpp
  122. Building CXX object CMakeFiles/meandmyshadow.dir/src/TreeStorageNode.cpp.o
  123. /usr/bin/x86_64-pc-linux-gnu-g++ -DNDEBUG -O2 -pipe -ggdb -march=native -ftracer -I/usr/include/SDL -I/tmp/portage/games-puzzle/meandmyshadow-0.3/work/meandmyshadow-0.3_build -o CMakeFiles/meandmyshadow.dir/src/LevelEditSelect.cpp.o -c /tmp/portage/games-puzzle/meandmyshadow-0.3/work/meandmyshadow-0.3/src/LevelEditSelect.cpp
  124. /usr/bin/x86_64-pc-linux-gnu-g++ -DNDEBUG -O2 -pipe -ggdb -march=native -ftracer -I/usr/include/SDL -I/tmp/portage/games-puzzle/meandmyshadow-0.3/work/meandmyshadow-0.3_build -o CMakeFiles/meandmyshadow.dir/src/TreeStorageNode.cpp.o -c /tmp/portage/games-puzzle/meandmyshadow-0.3/work/meandmyshadow-0.3/src/TreeStorageNode.cpp
  125. /usr/bin/cmake -E cmake_progress_report /tmp/portage/games-puzzle/meandmyshadow-0.3/work/meandmyshadow-0.3_build/CMakeFiles 19
  126. /usr/bin/cmake -E cmake_progress_report /tmp/portage/games-puzzle/meandmyshadow-0.3/work/meandmyshadow-0.3_build/CMakeFiles 20
  127. /usr/bin/cmake -E cmake_progress_report /tmp/portage/games-puzzle/meandmyshadow-0.3/work/meandmyshadow-0.3_build/CMakeFiles 21
  128. /usr/bin/cmake -E cmake_progress_report /tmp/portage/games-puzzle/meandmyshadow-0.3/work/meandmyshadow-0.3_build/CMakeFiles 22
  129. /usr/bin/cmake -E cmake_progress_report /tmp/portage/games-puzzle/meandmyshadow-0.3/work/meandmyshadow-0.3_build/CMakeFiles 23
  130. /usr/bin/cmake -E cmake_progress_report /tmp/portage/games-puzzle/meandmyshadow-0.3/work/meandmyshadow-0.3_build/CMakeFiles 24
  131. Building CXX object CMakeFiles/meandmyshadow.dir/src/Shadow.cpp.o
  132. /usr/bin/x86_64-pc-linux-gnu-g++ -DNDEBUG -O2 -pipe -ggdb -march=native -ftracer -I/usr/include/SDL -I/tmp/portage/games-puzzle/meandmyshadow-0.3/work/meandmyshadow-0.3_build -o CMakeFiles/meandmyshadow.dir/src/Shadow.cpp.o -c /tmp/portage/games-puzzle/meandmyshadow-0.3/work/meandmyshadow-0.3/src/Shadow.cpp
  133. [ 60%] [ 63%] [ 70%] [ 70%] [ 73%] [ 80%] Building CXX object CMakeFiles/meandmyshadow.dir/src/LevelSelect.cpp.o
  134. [ 80%] /usr/bin/x86_64-pc-linux-gnu-g++ -DNDEBUG -O2 -pipe -ggdb -march=native -ftracer -I/usr/include/SDL -I/tmp/portage/games-puzzle/meandmyshadow-0.3/work/meandmyshadow-0.3_build -o CMakeFiles/meandmyshadow.dir/src/LevelSelect.cpp.o -c /tmp/portage/games-puzzle/meandmyshadow-0.3/work/meandmyshadow-0.3/src/LevelSelect.cpp
  135. Building CXX object CMakeFiles/meandmyshadow.dir/src/POASerializer.cpp.o
  136. /usr/bin/x86_64-pc-linux-gnu-g++ -DNDEBUG -O2 -pipe -ggdb -march=native -ftracer -I/usr/include/SDL -I/tmp/portage/games-puzzle/meandmyshadow-0.3/work/meandmyshadow-0.3_build -o CMakeFiles/meandmyshadow.dir/src/POASerializer.cpp.o -c /tmp/portage/games-puzzle/meandmyshadow-0.3/work/meandmyshadow-0.3/src/POASerializer.cpp
  137. Building CXX object CMakeFiles/meandmyshadow.dir/src/Player.cpp.o
  138. Building CXX object CMakeFiles/meandmyshadow.dir/src/Globals.cpp.o
  139. /usr/bin/x86_64-pc-linux-gnu-g++ -DNDEBUG -O2 -pipe -ggdb -march=native -ftracer -I/usr/include/SDL -I/tmp/portage/games-puzzle/meandmyshadow-0.3/work/meandmyshadow-0.3_build -o CMakeFiles/meandmyshadow.dir/src/Player.cpp.o -c /tmp/portage/games-puzzle/meandmyshadow-0.3/work/meandmyshadow-0.3/src/Player.cpp
  140. Building CXX object CMakeFiles/meandmyshadow.dir/src/MD5.cpp.o
  141. /usr/bin/x86_64-pc-linux-gnu-g++ -DNDEBUG -O2 -pipe -ggdb -march=native -ftracer -I/usr/include/SDL -I/tmp/portage/games-puzzle/meandmyshadow-0.3/work/meandmyshadow-0.3_build -o CMakeFiles/meandmyshadow.dir/src/Globals.cpp.o -c /tmp/portage/games-puzzle/meandmyshadow-0.3/work/meandmyshadow-0.3/src/Globals.cpp
  142. /usr/bin/x86_64-pc-linux-gnu-g++ -DNDEBUG -O2 -pipe -ggdb -march=native -ftracer -I/usr/include/SDL -I/tmp/portage/games-puzzle/meandmyshadow-0.3/work/meandmyshadow-0.3_build -o CMakeFiles/meandmyshadow.dir/src/MD5.cpp.o -c /tmp/portage/games-puzzle/meandmyshadow-0.3/work/meandmyshadow-0.3/src/MD5.cpp
  143. Building CXX object CMakeFiles/meandmyshadow.dir/src/Block.cpp.o
  144. Building CXX object CMakeFiles/meandmyshadow.dir/src/Main.cpp.o
  145. /usr/bin/x86_64-pc-linux-gnu-g++ -DNDEBUG -O2 -pipe -ggdb -march=native -ftracer -I/usr/include/SDL -I/tmp/portage/games-puzzle/meandmyshadow-0.3/work/meandmyshadow-0.3_build -o CMakeFiles/meandmyshadow.dir/src/Block.cpp.o -c /tmp/portage/games-puzzle/meandmyshadow-0.3/work/meandmyshadow-0.3/src/Block.cpp
  146. /usr/bin/x86_64-pc-linux-gnu-g++ -DNDEBUG -O2 -pipe -ggdb -march=native -ftracer -I/usr/include/SDL -I/tmp/portage/games-puzzle/meandmyshadow-0.3/work/meandmyshadow-0.3_build -o CMakeFiles/meandmyshadow.dir/src/Main.cpp.o -c /tmp/portage/games-puzzle/meandmyshadow-0.3/work/meandmyshadow-0.3/src/Main.cpp
  147. /usr/bin/cmake -E cmake_progress_report /tmp/portage/games-puzzle/meandmyshadow-0.3/work/meandmyshadow-0.3_build/CMakeFiles 25
  148. [ 83%] Building CXX object CMakeFiles/meandmyshadow.dir/src/ImageManager.cpp.o
  149. /usr/bin/x86_64-pc-linux-gnu-g++ -DNDEBUG -O2 -pipe -ggdb -march=native -ftracer -I/usr/include/SDL -I/tmp/portage/games-puzzle/meandmyshadow-0.3/work/meandmyshadow-0.3_build -o CMakeFiles/meandmyshadow.dir/src/ImageManager.cpp.o -c /tmp/portage/games-puzzle/meandmyshadow-0.3/work/meandmyshadow-0.3/src/ImageManager.cpp
  150. /usr/bin/cmake -E cmake_progress_report /tmp/portage/games-puzzle/meandmyshadow-0.3/work/meandmyshadow-0.3_build/CMakeFiles 26
  151. [ 86%] Building CXX object CMakeFiles/meandmyshadow.dir/src/GUIListBox.cpp.o
  152. /usr/bin/x86_64-pc-linux-gnu-g++ -DNDEBUG -O2 -pipe -ggdb -march=native -ftracer -I/usr/include/SDL -I/tmp/portage/games-puzzle/meandmyshadow-0.3/work/meandmyshadow-0.3_build -o CMakeFiles/meandmyshadow.dir/src/GUIListBox.cpp.o -c /tmp/portage/games-puzzle/meandmyshadow-0.3/work/meandmyshadow-0.3/src/GUIListBox.cpp
  153. /tmp/portage/games-puzzle/meandmyshadow-0.3/work/meandmyshadow-0.3/src/TreeStorageNode.cpp: In member function 'virtual void* TreeStorageNode::getNextNode(void*, ITreeStorageReader*&)':
  154. /tmp/portage/games-puzzle/meandmyshadow-0.3/work/meandmyshadow-0.3/src/TreeStorageNode.cpp:81:2: error: 'intptr_t' was not declared in this scope
  155. /tmp/portage/games-puzzle/meandmyshadow-0.3/work/meandmyshadow-0.3/src/TreeStorageNode.cpp:81:11: error: expected ';' before 'i'
  156. /tmp/portage/games-puzzle/meandmyshadow-0.3/work/meandmyshadow-0.3/src/TreeStorageNode.cpp:84:5: error: 'i' was not declared in this scope
  157. make[2]: *** [CMakeFiles/meandmyshadow.dir/src/TreeStorageNode.cpp.o] Error 1
  158. make[2]: *** Waiting for unfinished jobs....
  159. /tmp/portage/games-puzzle/meandmyshadow-0.3/work/meandmyshadow-0.3/src/Addons.cpp: In member function 'bool Addons::getAddonsList(FILE*)':
  160. /tmp/portage/games-puzzle/meandmyshadow-0.3/work/meandmyshadow-0.3/src/Addons.cpp:144:16: warning: converting 'false' to pointer type 'void*' [-Wconversion-null]
  161. make[2]: Leaving directory `/tmp/portage/games-puzzle/meandmyshadow-0.3/work/meandmyshadow-0.3_build'
  162. make[1]: *** [CMakeFiles/meandmyshadow.dir/all] Error 2
  163. make[1]: Leaving directory `/tmp/portage/games-puzzle/meandmyshadow-0.3/work/meandmyshadow-0.3_build'
  164. make: *** [all] Error 2
  165. emake failed
  166. * ERROR: games-puzzle/meandmyshadow-0.3 failed (compile phase):
  167. * Make failed!
  168. *
  169. * Call stack:
  170. * ebuild.sh, line 85: Called src_compile
  171. * environment, line 2932: Called cmake-utils_src_compile
  172. * environment, line 734: Called _execute_optionaly 'src_compile'
  173. * environment, line 260: Called enable_cmake-utils_src_compile
  174. * environment, line 992: Called cmake-utils_src_make
  175. * environment, line 751: Called die
  176. * The specific snippet of code:
  177. * emake VERBOSE=1 "$@" || die "Make failed!";
  178. *
  179. * If you need support, post the output of `emerge --info '=games-puzzle/meandmyshadow-0.3'`,
  180. * the complete build log and the output of `emerge -pqv '=games-puzzle/meandmyshadow-0.3'`.
  181. sed: couldn't open temporary file /etc/portage/package.mask/sedUC0JNC: Permission denied