1. * Package: games-arcade/stardork-0.7
  2. * Repository: gentoo
  3. * Maintainer: games@gentoo.org
  4. * USE: abi_x86_64 amd64 elibc_glibc kernel_linux test userland_GNU
  5. * FEATURES: sandbox test userpriv usersandbox
  6. Installed LAPACK for library directory lib64
  7. [1] reference *
  8. Installed BLAS for library directory lib64
  9. [1] reference *
  10. Installed CBLAS for library directory lib64
  11. [1] gsl
  12. [2] reference *
  13. >>> Unpacking source...
  14. >>> Unpacking stardork-0.7.tar.gz to /tmp/portage/games-arcade/stardork-0.7/work
  15. >>> Source unpacked in /tmp/portage/games-arcade/stardork-0.7/work
  16. >>> Preparing source in /tmp/portage/games-arcade/stardork-0.7/work/stardork-0.7 ...
  17. >>> Source prepared.
  18. >>> Configuring source in /tmp/portage/games-arcade/stardork-0.7/work/stardork-0.7 ...
  19. >>> Source configured.
  20. >>> Compiling source in /tmp/portage/games-arcade/stardork-0.7/work/stardork-0.7 ...
  21. make -j24 CC=x86_64-pc-linux-gnu-gcc LDLIBS=-lncurses stardork
  22. x86_64-pc-linux-gnu-gcc -O2 -pipe -ggdb -march=native -ftracer -frecord-gcc-switches -Wl,-O1 -Wl,--as-needed stardork.c -lncurses -o stardork
  23. /usr/lib/gcc/x86_64-pc-linux-gnu/4.9.2/../../../../x86_64-pc-linux-gnu/bin/ld: /tmp/portage/games-arcade/stardork-0.7/temp/ccJDZyNG.o: undefined reference to symbol 'cbreak'
  24. /lib64/libtinfo.so.5: error adding symbols: DSO missing from command line
  25. collect2: error: ld returned 1 exit status
  26. <builtin>: recipe for target 'stardork' failed
  27. make: *** [stardork] Error 1
  28. emake failed
  29. * ERROR: games-arcade/stardork-0.7::gentoo failed (compile phase):
  30. * (no error message)
  31. *
  32. * Call stack:
  33. * ebuild.sh, line 93: Called src_compile
  34. * environment, line 2762: Called die
  35. * The specific snippet of code:
  36. * emake CC="$(tc-getCC)" LDLIBS=-lncurses ${PN} || die
  37. *
  38. * If you need support, post the output of `emerge --info '=games-arcade/stardork-0.7::gentoo'`,
  39. * the complete build log and the output of `emerge -pqv '=games-arcade/stardork-0.7::gentoo'`.
  40. sed: couldn't open temporary file /etc/portage/package.mask/sedGQ3GQd: Permission denied