1. * Package: games-arcade/gnake-0.94b
  2. * Repository: gentoo
  3. * Maintainer: games@gentoo.org
  4. * USE: abi_x86_64 amd64 elibc_glibc kernel_linux test userland_GNU
  5. * FEATURES: sandbox test userpriv usersandbox
  6. Installed LAPACK for library directory lib64
  7. [1] reference *
  8. Installed BLAS for library directory lib64
  9. [1] reference *
  10. Installed CBLAS for library directory lib64
  11. [1] gsl
  12. [2] reference *
  13. >>> Unpacking source...
  14. >>> Unpacking Gnake.0.94b.tar.gz to /tmp/portage/games-arcade/gnake-0.94b/work
  15. >>> Source unpacked in /tmp/portage/games-arcade/gnake-0.94b/work
  16. >>> Compiling source in /tmp/portage/games-arcade/gnake-0.94b/work/gnake ...
  17. make -j24 LDLIBS=-lncurses gnake
  18. x86_64-pc-linux-gnu-gcc -O2 -pipe -ggdb -march=native -ftracer -frecord-gcc-switches -Wl,-O1 -Wl,--as-needed gnake.c -lncurses -o gnake
  19. gnake.c: In function 'Resize':
  20. gnake.c:724:3: warning: ignoring return value of 'fscanf', declared with attribute warn_unused_result [-Wunused-result]
  21. fscanf(p, " %d %d", &l, &c);
  22. ^
  23. /usr/lib/gcc/x86_64-pc-linux-gnu/4.9.2/../../../../x86_64-pc-linux-gnu/bin/ld: /tmp/portage/games-arcade/gnake-0.94b/temp/cc8KL7CM.o: undefined reference to symbol 'cbreak'
  24. /lib64/libtinfo.so.5: error adding symbols: DSO missing from command line
  25. collect2: error: ld returned 1 exit status
  26. <builtin>: recipe for target 'gnake' failed
  27. make: *** [gnake] Error 1
  28. emake failed
  29. * ERROR: games-arcade/gnake-0.94b::gentoo failed (compile phase):
  30. * emake failed
  31. *
  32. * Call stack:
  33. * ebuild.sh, line 93: Called src_compile
  34. * environment, line 2761: Called die
  35. * The specific snippet of code:
  36. * emake LDLIBS=-lncurses gnake || die "emake failed"
  37. *
  38. * If you need support, post the output of `emerge --info '=games-arcade/gnake-0.94b::gentoo'`,
  39. * the complete build log and the output of `emerge -pqv '=games-arcade/gnake-0.94b::gentoo'`.
  40. sed: couldn't open temporary file /etc/portage/package.mask/sedw4YhaA: Permission denied