1. * Package: app-misc/delay-1.6-r1
  2. * Repository: gentoo
  3. * Maintainer: shell-tools@gentoo.org
  4. * USE: abi_x86_64 amd64 elibc_glibc kernel_linux test userland_GNU
  5. * FEATURES: sandbox test userpriv usersandbox
  6. Installed LAPACK for library directory lib64
  7. [1] reference *
  8. Installed BLAS for library directory lib64
  9. [1] reference *
  10. Installed CBLAS for library directory lib64
  11. [1] gsl
  12. [2] reference *
  13. >>> Unpacking source...
  14. >>> Unpacking delay-1.6.tar.gz to /tmp/portage/app-misc/delay-1.6-r1/work
  15. >>> Source unpacked in /tmp/portage/app-misc/delay-1.6-r1/work
  16. >>> Preparing source in /tmp/portage/app-misc/delay-1.6-r1/work/delay-1.6 ...
  17. >>> Source prepared.
  18. >>> Configuring source in /tmp/portage/app-misc/delay-1.6-r1/work/delay-1.6 ...
  19. ./configure --prefix=/usr --build=x86_64-pc-linux-gnu --host=x86_64-pc-linux-gnu --mandir=/usr/share/man --infodir=/usr/share/info --datadir=/usr/share --sysconfdir=/etc --localstatedir=/var/lib --libdir=/usr/lib64
  20. creating cache ./config.cache
  21. checking for a BSD compatible install... /usr/bin/install -c
  22. checking whether build environment is sane... yes
  23. checking whether make sets ${MAKE}... yes
  24. checking for working aclocal... found
  25. checking for working autoconf... found
  26. checking for working automake... missing
  27. checking for working autoheader... found
  28. checking for working makeinfo... found
  29. checking for gcc... x86_64-pc-linux-gnu-gcc
  30. checking whether the C compiler (x86_64-pc-linux-gnu-gcc -O2 -pipe -ggdb -march=native -ftracer -frecord-gcc-switches -Wl,-O1 -Wl,--as-needed) works... yes
  31. checking whether the C compiler (x86_64-pc-linux-gnu-gcc -O2 -pipe -ggdb -march=native -ftracer -frecord-gcc-switches -Wl,-O1 -Wl,--as-needed) is a cross-compiler... no
  32. checking whether we are using GNU C... yes
  33. checking whether x86_64-pc-linux-gnu-gcc accepts -g... yes
  34. checking for bison... bison -y
  35. checking how to run the C preprocessor... x86_64-pc-linux-gnu-gcc -E
  36. checking for flex... flex
  37. checking for flex... (cached) flex
  38. checking for yywrap in -lfl... yes
  39. checking lex output file root... lex.yy
  40. checking whether yytext is a pointer... yes
  41. checking for ANSI C header files... yes
  42. checking whether struct tm is in sys/time.h or time.h... time.h
  43. checking for tm_gmtoff in struct tm... yes
  44. checking for initscr in -lcurses... yes
  45. checking for curses.h... yes
  46. updating cache ./config.cache
  47. creating ./config.status
  48. creating Makefile
  49. >>> Source configured.
  50. >>> Compiling source in /tmp/portage/app-misc/delay-1.6-r1/work/delay-1.6 ...
  51. make -j24
  52. x86_64-pc-linux-gnu-gcc -DPACKAGE=\"delay\" -DVERSION=\"1.6\" -DYYTEXT_POINTER=1 -DSTDC_HEADERS=1 -DHAVE_TM_GMTOFF=1 -DHAVE_LIBCURSES=1 -DHAVE_CURSES_H=1 -I. -I. -O2 -pipe -ggdb -march=native -ftracer -frecord-gcc-switches -c delay.c
  53. x86_64-pc-linux-gnu-gcc -DPACKAGE=\"delay\" -DVERSION=\"1.6\" -DYYTEXT_POINTER=1 -DSTDC_HEADERS=1 -DHAVE_TM_GMTOFF=1 -DHAVE_LIBCURSES=1 -DHAVE_CURSES_H=1 -I. -I. -O2 -pipe -ggdb -march=native -ftracer -frecord-gcc-switches -c curses.c
  54. x86_64-pc-linux-gnu-gcc -DPACKAGE=\"delay\" -DVERSION=\"1.6\" -DYYTEXT_POINTER=1 -DSTDC_HEADERS=1 -DHAVE_TM_GMTOFF=1 -DHAVE_LIBCURSES=1 -DHAVE_CURSES_H=1 -I. -I. -O2 -pipe -ggdb -march=native -ftracer -frecord-gcc-switches -c parsetimey.c
  55. x86_64-pc-linux-gnu-gcc -DPACKAGE=\"delay\" -DVERSION=\"1.6\" -DYYTEXT_POINTER=1 -DSTDC_HEADERS=1 -DHAVE_TM_GMTOFF=1 -DHAVE_LIBCURSES=1 -DHAVE_CURSES_H=1 -I. -I. -O2 -pipe -ggdb -march=native -ftracer -frecord-gcc-switches -c parsetimel.c
  56. x86_64-pc-linux-gnu-gcc -O2 -pipe -ggdb -march=native -ftracer -frecord-gcc-switches -Wl,-O1 -Wl,--as-needed -o delay delay.o curses.o parsetimey.o parsetimel.o -lcurses
  57. /usr/lib/gcc/x86_64-pc-linux-gnu/4.9.1/../../../../x86_64-pc-linux-gnu/bin/ld: curses.o: undefined reference to symbol 'LINES'
  58. /lib64/libtinfo.so.5: error adding symbols: DSO missing from command line
  59. collect2: error: ld returned 1 exit status
  60. Makefile:176: recipe for target 'delay' failed
  61. make: *** [delay] Error 1
  62. * ERROR: app-misc/delay-1.6-r1::gentoo failed (compile phase):
  63. * emake failed
  64. *
  65. * If you need support, post the output of `emerge --info '=app-misc/delay-1.6-r1::gentoo'`,
  66. * the complete build log and the output of `emerge -pqv '=app-misc/delay-1.6-r1::gentoo'`.
  67. * The complete build log is located at '/var/log/portage/app-misc:delay-1.6-r1:20141025-114042.log'.
  68. * The ebuild environment file is located at '/tmp/portage/app-misc/delay-1.6-r1/temp/environment'.
  69. * Working directory: '/tmp/portage/app-misc/delay-1.6-r1/work/delay-1.6'
  70. * S: '/tmp/portage/app-misc/delay-1.6-r1/work/delay-1.6'